VIFIB DESCENTRALIZED CLOUD COMPUTING

SlapOS is a decentralized Cloud Computing technology that can automate the deployment and configuration of applications in a heterogeneous environment.
kedifa
869.063
76
8
1
1
FAILED
Completed
SLAPOS_TEST_LOG_DIRECTORY=/srv/slapgrid/slappart0/var/log/testnode/bvi-ZpUq5zgsiu SLAPOS_TEST_SHARED_PART_LIST=/srv/slapgrid/slappart0/srv/shared:/srv/slapgrid/slappart0/srv/testnode/bvi/shared /srv/slapgrid/slappart0/srv/testnode/bvi/soft/b46f68b4c79e8fe509633311b0a555b8/bin/python_for_test setup.py test
Warning: build in /srv/slapgrid/slappart0/srv/testnode/bvi/soft/b46f68b4c79e8fe509633311b0a555b8/parts/kedifa-repository is using versioneer.py from /srv/slapgrid/slappart0/srv/testnode/bvi/inst/test0-0/parts/kedifa/versioneer.py
running test
running egg_info
creating kedifa.egg-info
writing requirements to kedifa.egg-info/requires.txt
writing kedifa.egg-info/PKG-INFO
writing top-level names to kedifa.egg-info/top_level.txt
writing dependency_links to kedifa.egg-info/dependency_links.txt
writing entry points to kedifa.egg-info/entry_points.txt
writing manifest file 'kedifa.egg-info/SOURCES.txt'
reading manifest file 'kedifa.egg-info/SOURCES.txt'
reading manifest template 'MANIFEST.in'
writing manifest file 'kedifa.egg-info/SOURCES.txt'
running build_ext
8816569581389130541 was (originally) automatically approved
8523828759779370744 was (originally) automatically approved
895363283931626688 was (originally) automatically approved
365963267203558110 was (originally) automatically approved
2762292865190970776 was (originally) automatically approved
235806155992140569 was (originally) automatically approved
778356665493467498 was (originally) automatically approved
104984826416410103 was (originally) automatically approved
329455155633980283 was (originally) automatically approved
8126122039229661763 was (originally) automatically approved
u'https://[2001:67c:1254:71:ef45::eda4]:53857/fpw83jveqid4h2g60jatfobbrz8jwyltMISSING' not downloaded, HTTP code 404
3651738135240334605 was (originally) automatically approved
3162996610214002472 was (originally) automatically approved
4353035910391414642 was (originally) automatically approved
2657796061981330601 was (originally) automatically approved
7955749353177147912 was (originally) automatically approved
7259041762783610060 was (originally) automatically approved
Certificate '/tmp/tmpBmAI2f/tmpnVaVBC': 'https://[2001:67c:1254:71:ef45::eda4]:50285/jffr0knjco23qrp2azogxdl0sa74uh25MISSING' not downloaded, HTTP code 404
6919872594593849305 was (originally) automatically approved
3206379923119943716 was (originally) automatically approved
54005768744578729 was (originally) automatically approved
7919680552852300708 was (originally) automatically approved
9071986578183704545 was (originally) automatically approved
825100911577956246 was (originally) automatically approved
5194764659822777947 was (originally) automatically approved
6797259696527111366 was (originally) automatically approved
u'https://[2001:67c:1254:71:ef45::eda4]:44361/xuwv592q3u463ea63wdes9tjmm6priv3' not downloaded, problem ('Connection aborted.', error(104, 'Connection reset by peer'))
5301586042245868733 was (originally) automatically approved
3193918684333278714 was (originally) automatically approved
2309712243209824465 was (originally) automatically approved
5438913417137659588 was (originally) automatically approved
2808458130522492849 was (originally) automatically approved
6973751783463235744 was (originally) automatically approved
5785228238123235496 was (originally) automatically approved
9116883187994850823 was (originally) automatically approved
1942429153405501763 was (originally) automatically approved
2997965152673405910 was (originally) automatically approved
8643266445511617591 was (originally) automatically approved
6708839208258847214 was (originally) automatically approved
2647932577958945017 was (originally) automatically approved
332377122437557022 was (originally) automatically approved
5761780156886017883 was (originally) automatically approved
1371470270855996400 was (originally) automatically approved
3256344666511448148 was (originally) automatically approved
9001462235191549813 was (originally) automatically approved
5330754520516343190 was (originally) automatically approved
973856418567278753 was (originally) automatically approved
9103716605253977834 was (originally) automatically approved
2240411893123601410 was (originally) automatically approved
6196663956105122865 was (originally) automatically approved
1653204835429502411 was (originally) automatically approved
1810740825686617911 was (originally) automatically approved
4578906002679445847 was (originally) automatically approved
Certificate '/tmp/tmptkTHzv/tmpxpiYN5': problem with 'https://[2001:67c:1254:71:ef45::eda4]:41783/5uz51b4rafxplypap90sud573z2bh50f' not downloaded: ('Connection aborted.', error(104, 'Connection reset by peer'))
5203180058814084754 was (originally) automatically approved
8585332514273424682 was (originally) automatically approved
7125309367939494604 was (originally) automatically approved
5279490163338314758 was (originally) automatically approved
8022475301995824727 was (originally) automatically approved
6401196580790632687 was (originally) automatically approved
5898417422016830383 was (originally) automatically approved
5304472379485148553 was (originally) automatically approved
3807493916347682464 was (originally) automatically approved
690956540671784233 was (originally) automatically approved
5056059272515170494 was (originally) automatically approved
1401732466756838278 was (originally) automatically approved
6105491201033486867 was (originally) automatically approved
7975337151789230839 was (originally) automatically approved
5503720064998722806 was (originally) automatically approved
2529493583407390477 was (originally) automatically approved
6331825028165793611 was (originally) automatically approved
502688436193021759 was (originally) automatically approved
8826679725655883058 was (originally) automatically approved
962006494828321445 was (originally) automatically approved
6182195525745866065 was (originally) automatically approved
1998661294029842591 was (originally) automatically approved
7454019026291250693 was (originally) automatically approved
6122965380325067584 was (originally) automatically approved
5362242901118704378 was (originally) automatically approved
4939544064622180052 was (originally) automatically approved
880015573825542677 was (originally) automatically approved
6498071874692253226 was (originally) automatically approved
Sleeping for 1s
Couldn't lock '/tmp/tmp_ivShq/tmpQjmMCP.lock'
...exiting.
Line 'buzz' is incorrect
Prepare: Used '/tmp/tmpsAXFR8/tmpSFzqDu' for '/tmp/tmpsAXFR8/tmpFICqM7'
Prepare: Used '/tmp/tmp8UaATl/tmp5NViek' for '/tmp/tmp8UaATl/tmp7YDD2U'
Prepare: Used '/tmp/tmpfOdTgS/tmp3S_lLD' for '/tmp/tmpfOdTgS/tmp2Ec_gc'
Certificate '/tmp/tmp8BsKyc/tmpnJSwQf': updated from 'http://example.com'
Certificate '/tmp/tmpeWWiET/tmp9GPRkZ': updated from 'http://example.com'
Certificate '/tmp/tmplF7I5F/tmpsO1LmH': updated from 'http://example.com'
Certificate '/tmp/tmpW3pg5U/tmpwH3hm7': updated from 'http://example.com'
Certificate '/tmp/tmpD4qPhH/tmpjmz5C2': updated from 'http://example.com'
Certificate '/tmp/tmpfWfXwG/tmp0x350M': updated from 'http://example.com'
Certificate '/tmp/tmpa3cu3y/tmpndXb4K': updated from 'http://example.com'
Certificate '/tmp/tmp8OOIry/tmpY_wot0': updated from 'http://example.com'
Certificate '/tmp/tmpOptc9S/tmpvhYecE': updated from 'http://example.com'
Certificate '/tmp/tmp7wwl0n/tmpfGzhib': updated from 'http://example.com'
Certificate '/tmp/tmpWt5GBC/tmplzH9mN': updated from 'http://example.com'
Certificate '/tmp/tmp6JDtUG/tmpZthD9I': updated from '/master/certificate/file'
Certificate '/tmp/tmpgSGAiU/tmpUwOWRF': updated from 'http://example.com'
WARNING: Testing via this command is deprecated and will be removed in a future version. Users looking for a generic test entry point independent of test runner are encouraged to use tox.
test_GET_cleanCertificate (kedifa.test.KedifaIntegrationTest) ... Listening on [2001:67c:1254:71:ef45::eda4]:52101-52102
ok
test_GET_existing (kedifa.test.KedifaIntegrationTest) ... Listening on [2001:67c:1254:71:ef45::eda4]:37273-37274
FAIL
test_GET_existing_exact (kedifa.test.KedifaIntegrationTest) ... Listening on [2001:67c:1254:71:ef45::eda4]:36515-36516
ok
test_GET_existing_getter (kedifa.test.KedifaIntegrationTest) ... Listening on [2001:67c:1254:71:ef45::eda4]:43899-43900
ok
test_GET_existing_getter_name_does_not_match (kedifa.test.KedifaIntegrationTest) ... Listening on [2001:67c:1254:71:ef45::eda4]:49969-49970
ok
test_GET_existing_no_identity (kedifa.test.KedifaIntegrationTest) ... Listening on [2001:67c:1254:71:ef45::eda4]:33515-33516
ok
test_GET_existing_updater (kedifa.test.KedifaIntegrationTest) ... Listening on [2001:67c:1254:71:ef45::eda4]:53659-53660
FAIL
test_GET_existing_updater_name_does_not_match (kedifa.test.KedifaIntegrationTest) ... Listening on [2001:67c:1254:71:ef45::eda4]:39983-39984
ok
test_GET_expired (kedifa.test.KedifaIntegrationTest) ... Listening on [2001:67c:1254:71:ef45::eda4]:46559-46560
ok
test_GET_expired_identity (kedifa.test.KedifaIntegrationTest) ... skipped 'Hard to implement, and already being partially covered by test_GET_revoked_identity'
test_GET_generateauth (kedifa.test.KedifaIntegrationTest) ... Listening on [2001:67c:1254:71:ef45::eda4]:41873-41874
ok
test_GET_generateauth_no_reserved (kedifa.test.KedifaIntegrationTest) ... Listening on [2001:67c:1254:71:ef45::eda4]:52239-52240
ok
test_GET_getter_unsigned_identity (kedifa.test.KedifaIntegrationTest) ... Listening on [2001:67c:1254:71:ef45::eda4]:39749-39750
ok
test_GET_invalid_yet (kedifa.test.KedifaIntegrationTest) ... Listening on [2001:67c:1254:71:ef45::eda4]:38997-38998
ok
test_GET_list (kedifa.test.KedifaIntegrationTest) ... Listening on [2001:67c:1254:71:ef45::eda4]:44309-44310
FAIL
test_GET_list_cleanCertificate (kedifa.test.KedifaIntegrationTest) ... Listening on [2001:67c:1254:71:ef45::eda4]:42999-43000
ok
test_GET_list_empty (kedifa.test.KedifaIntegrationTest) ... Listening on [2001:67c:1254:71:ef45::eda4]:41579-41580
ok
test_GET_list_no_identity (kedifa.test.KedifaIntegrationTest) ... Listening on [2001:67c:1254:71:ef45::eda4]:40697-40698
ok
test_GET_new_server_ca (kedifa.test.KedifaIntegrationTest) ... Listening on [2001:67c:1254:71:ef45::eda4]:41277-41278
Listening on [2001:67c:1254:71:ef45::eda4]:48719-48720
ok
test_GET_not_existing (kedifa.test.KedifaIntegrationTest) ... Listening on [2001:67c:1254:71:ef45::eda4]:60919-60920
FAIL
test_GET_order (kedifa.test.KedifaIntegrationTest) ... Listening on [2001:67c:1254:71:ef45::eda4]:60363-60364
ok
test_GET_revoked_identity (kedifa.test.KedifaIntegrationTest) ... Listening on [2001:67c:1254:71:ef45::eda4]:49449-49450
FAIL
test_GET_root (kedifa.test.KedifaIntegrationTest) ... Listening on [2001:67c:1254:71:ef45::eda4]:36667-36668
ok
test_GET_unsigned_identity (kedifa.test.KedifaIntegrationTest) ... Listening on [2001:67c:1254:71:ef45::eda4]:57345-57346
FAIL
test_GET_updater_unsigned_identity (kedifa.test.KedifaIntegrationTest) ... Listening on [2001:67c:1254:71:ef45::eda4]:52695-52696
ok
test_PUT (kedifa.test.KedifaIntegrationTest) ... Listening on [2001:67c:1254:71:ef45::eda4]:48529-48530
FAIL
test_PUT_bad (kedifa.test.KedifaIntegrationTest) ... Listening on [2001:67c:1254:71:ef45::eda4]:55711-55712
ok
test_PUT_bad_auth (kedifa.test.KedifaIntegrationTest) ... Listening on [2001:67c:1254:71:ef45::eda4]:39701-39702
ok
test_PUT_certificate_expired (kedifa.test.KedifaIntegrationTest) ... Listening on [2001:67c:1254:71:ef45::eda4]:43095-43096
ok
test_PUT_certificate_key_mismatch (kedifa.test.KedifaIntegrationTest) ... Listening on [2001:67c:1254:71:ef45::eda4]:34257-34258
ok
test_PUT_certificate_not_valid_yet (kedifa.test.KedifaIntegrationTest) ... Listening on [2001:67c:1254:71:ef45::eda4]:37411-37412
ok
test_PUT_certificate_only (kedifa.test.KedifaIntegrationTest) ... Listening on [2001:67c:1254:71:ef45::eda4]:36469-36470
ERROR
test_PUT_key_before_certificate (kedifa.test.KedifaIntegrationTest) ... Listening on [2001:67c:1254:71:ef45::eda4]:47231-47232
ok
test_PUT_key_only (kedifa.test.KedifaIntegrationTest) ... Listening on [2001:67c:1254:71:ef45::eda4]:60175-60176
ok
test_PUT_multiple_different_reference (kedifa.test.KedifaIntegrationTest) ... Listening on [2001:67c:1254:71:ef45::eda4]:33779-33780
FAIL
test_PUT_multiple_same_reference (kedifa.test.KedifaIntegrationTest) ... Listening on [2001:67c:1254:71:ef45::eda4]:34863-34864
ok
test_PUT_no_auth (kedifa.test.KedifaIntegrationTest) ... Listening on [2001:67c:1254:71:ef45::eda4]:58571-58572
ok
test_bad_query_string (kedifa.test.KedifaIntegrationTest) ... Listening on [2001:67c:1254:71:ef45::eda4]:35939-35940
ok
test_reload_log (kedifa.test.KedifaIntegrationTest) ... Listening on [2001:67c:1254:71:ef45::eda4]:55409-55410
ok
test (kedifa.test.KedifaUpdaterLoopTest) ... ok
test_infinite (kedifa.test.KedifaUpdaterLoopTest) ... ok
test_lock (kedifa.test.KedifaUpdaterLoopTest) ... ok
test_raises (kedifa.test.KedifaUpdaterLoopTest) ... ok
test_updateMapping_empty (kedifa.test.KedifaUpdaterMappingTest) ... ok
test_updateMapping_morewhite (kedifa.test.KedifaUpdaterMappingTest) ... ok
test_updateMapping_normal (kedifa.test.KedifaUpdaterMappingTest) ... ok
test_updateMapping_one_comment (kedifa.test.KedifaUpdaterMappingTest) ... ok
test_updateMapping_one_empty (kedifa.test.KedifaUpdaterMappingTest) ... ok
test_updateMapping_one_not_enough (kedifa.test.KedifaUpdaterMappingTest) ... ok
test_updateMapping_with_fallback (kedifa.test.KedifaUpdaterMappingTest) ... ok
test_cert_master_fallback (kedifa.test.KedifaUpdaterUpdateCertificatePrepareTest) ... ok
test_cert_master_nofallback (kedifa.test.KedifaUpdaterUpdateCertificatePrepareTest) ... ok
test_cert_nomaster_fallback (kedifa.test.KedifaUpdaterUpdateCertificatePrepareTest) ... ok
test_cert_nomaster_nofallback (kedifa.test.KedifaUpdaterUpdateCertificatePrepareTest) ... ok
test_nocert_master_fallback (kedifa.test.KedifaUpdaterUpdateCertificatePrepareTest) ... ok
test_nocert_master_nofallback (kedifa.test.KedifaUpdaterUpdateCertificatePrepareTest) ... ok
test_nocert_nomaster_fallback (kedifa.test.KedifaUpdaterUpdateCertificatePrepareTest) ... ok
test_nocert_nomaster_nofallback (kedifa.test.KedifaUpdaterUpdateCertificatePrepareTest) ... ok
test_cert_fetch_master_fallback (kedifa.test.KedifaUpdaterUpdateCertificateTest) ... ok
test_cert_fetch_master_nofallback (kedifa.test.KedifaUpdaterUpdateCertificateTest) ... ok
test_cert_fetch_nomaster_fallback (kedifa.test.KedifaUpdaterUpdateCertificateTest) ... ok
test_cert_fetch_nomaster_nofallback (kedifa.test.KedifaUpdaterUpdateCertificateTest) ... ok
test_cert_nofetch_master_fallback (kedifa.test.KedifaUpdaterUpdateCertificateTest) ... ok
test_cert_nofetch_master_fallback_overridden (kedifa.test.KedifaUpdaterUpdateCertificateTest) ... ok
test_cert_nofetch_master_nofallback (kedifa.test.KedifaUpdaterUpdateCertificateTest) ... ok
test_cert_nofetch_nomaster_fallback (kedifa.test.KedifaUpdaterUpdateCertificateTest) ... ok
test_cert_nofetch_nomaster_fallback_overridden (kedifa.test.KedifaUpdaterUpdateCertificateTest) ... ok
test_cert_nofetch_nomaster_nofallback (kedifa.test.KedifaUpdaterUpdateCertificateTest) ... ok
test_nocert_fetch_master_fallback (kedifa.test.KedifaUpdaterUpdateCertificateTest) ... ok
test_nocert_fetch_master_nofallback (kedifa.test.KedifaUpdaterUpdateCertificateTest) ... ok
test_nocert_fetch_nomaster_fallback (kedifa.test.KedifaUpdaterUpdateCertificateTest) ... ok
test_nocert_fetch_nomaster_nofallback (kedifa.test.KedifaUpdaterUpdateCertificateTest) ... ok
test_nocert_nofetch_master_fallback (kedifa.test.KedifaUpdaterUpdateCertificateTest) ... ok
test_nocert_nofetch_master_nofallback (kedifa.test.KedifaUpdaterUpdateCertificateTest) ... ok
test_nocert_nofetch_nomaster_fallback (kedifa.test.KedifaUpdaterUpdateCertificateTest) ... ok
test_nocert_nofetch_nomaster_nofallback (kedifa.test.KedifaUpdaterUpdateCertificateTest) ... ok

======================================================================
ERROR: test_PUT_certificate_only (kedifa.test.KedifaIntegrationTest)
----------------------------------------------------------------------
Traceback (most recent call last):
File "/srv/slapgrid/slappart0/srv/testnode/bvi/inst/test0-0/parts/kedifa/kedifa/test.py", line 294, in setUp
self.setUpKedifa(self.kedifa_ip)
File "/srv/slapgrid/slappart0/srv/testnode/bvi/inst/test0-0/parts/kedifa/kedifa/test.py", line 253, in setUpKedifa
'Kedifa not available after %.2fs seconds' % (time.time() - b))
AssertionError: Kedifa not available after 5.07s seconds

======================================================================
FAIL: test_GET_existing (kedifa.test.KedifaIntegrationTest)
----------------------------------------------------------------------
Traceback (most recent call last):
File "/srv/slapgrid/slappart0/srv/testnode/bvi/inst/test0-0/parts/kedifa/kedifa/test.py", line 414, in test_GET_existing
self.assertLastLogEntry('"GET /%s HTTP/1.1" 200' % (self.reference,))
File "/srv/slapgrid/slappart0/srv/testnode/bvi/inst/test0-0/parts/kedifa/kedifa/test.py", line 319, in assertLastLogEntry
entry in last_log_line, '%r not found in %r' % (entry, last_log_line))
AssertionError: u'"GET /oehfqqew2l5antgd3kckp5ft3pdpmx3o HTTP/1.1" 200' not found in '2020-09-18 07:47:51,742 - kedifa - INFO - 2001:67c:1254:71:ef45::eda4 - - [18/Sep/2020:05:47:51 +0000] "PUT /oehfqqew2l5antgd3kckp5ft3pdpmx3o?auth=vpvq0lnd02njpatmpzqeaamjlx2uws3a HTTP/1.1" 201 0 "-" "python-requests/2.24.0"\n'

======================================================================
FAIL: test_GET_existing_updater (kedifa.test.KedifaIntegrationTest)
----------------------------------------------------------------------
Traceback (most recent call last):
File "/srv/slapgrid/slappart0/srv/testnode/bvi/inst/test0-0/parts/kedifa/kedifa/test.py", line 561, in test_GET_existing_updater
self.put()
File "/srv/slapgrid/slappart0/srv/testnode/bvi/inst/test0-0/parts/kedifa/kedifa/test.py", line 904, in put
self.assertLastLogEntry('"PUT /%s?auth=%s HTTP/1.1" 201' % (key, auth))
File "/srv/slapgrid/slappart0/srv/testnode/bvi/inst/test0-0/parts/kedifa/kedifa/test.py", line 319, in assertLastLogEntry
entry in last_log_line, '%r not found in %r' % (entry, last_log_line))
AssertionError: u'"PUT /3u2qp2619ece7p4x9y6mdvw394xx3axn?auth=tl3im617odd0md0haaodfas9kltb7y8q HTTP/1.1" 201' not found in '2020-09-18 07:49:44,642 - kedifa - INFO - 2001:67c:1254:71:ef45::eda4 - - [18/Sep/2020:05:49:44 +0000] "GET /3u2qp2619ece7p4x9y6mdvw394xx3axn/generateauth HTTP/1.1" 201 32 "-" "python-requests/2.24.0"\n'

======================================================================
FAIL: test_GET_list (kedifa.test.KedifaIntegrationTest)
----------------------------------------------------------------------
Traceback (most recent call last):
File "/srv/slapgrid/slappart0/srv/testnode/bvi/inst/test0-0/parts/kedifa/kedifa/test.py", line 617, in test_GET_list
self.put()
File "/srv/slapgrid/slappart0/srv/testnode/bvi/inst/test0-0/parts/kedifa/kedifa/test.py", line 904, in put
self.assertLastLogEntry('"PUT /%s?auth=%s HTTP/1.1" 201' % (key, auth))
File "/srv/slapgrid/slappart0/srv/testnode/bvi/inst/test0-0/parts/kedifa/kedifa/test.py", line 319, in assertLastLogEntry
entry in last_log_line, '%r not found in %r' % (entry, last_log_line))
AssertionError: u'"PUT /v00yrjpf1k4q0sef53p55jkmnnzl9871?auth=cxt22vidh3bb2j1wbv8h4m9x0mpiux2v HTTP/1.1" 201' not found in '2020-09-18 07:52:25,634 - kedifa - INFO - 2001:67c:1254:71:ef45::eda4 - - [18/Sep/2020:05:52:25 +0000] "GET /v00yrjpf1k4q0sef53p55jkmnnzl9871/generateauth HTTP/1.1" 201 32 "-" "python-requests/2.24.0"\n'

======================================================================
FAIL: test_GET_not_existing (kedifa.test.KedifaIntegrationTest)
----------------------------------------------------------------------
Traceback (most recent call last):
File "/srv/slapgrid/slappart0/srv/testnode/bvi/inst/test0-0/parts/kedifa/kedifa/test.py", line 400, in test_GET_not_existing
self.assertLastLogEntry('"GET /%s HTTP/1.1" 404' % (self.reference,))
File "/srv/slapgrid/slappart0/srv/testnode/bvi/inst/test0-0/parts/kedifa/kedifa/test.py", line 319, in assertLastLogEntry
entry in last_log_line, '%r not found in %r' % (entry, last_log_line))
AssertionError: u'"GET /5cfuihyqu0yqlvfndznnoikk6rxu6j14 HTTP/1.1" 404' not found in '2020-09-18 07:54:38,543 - kedifa - INFO - 2001:67c:1254:71:ef45::eda4 - 721061327454350289114317107898762998481022331310 [18/Sep/2020:05:54:38 +0000] "POST /reserve-id HTTP/1.1" 201 32 "-" "python-requests/2.24.0"\n'

======================================================================
FAIL: test_GET_revoked_identity (kedifa.test.KedifaIntegrationTest)
----------------------------------------------------------------------
Traceback (most recent call last):
File "/srv/slapgrid/slappart0/srv/testnode/bvi/inst/test0-0/parts/kedifa/kedifa/test.py", line 450, in test_GET_revoked_identity
self.put()
File "/srv/slapgrid/slappart0/srv/testnode/bvi/inst/test0-0/parts/kedifa/kedifa/test.py", line 904, in put
self.assertLastLogEntry('"PUT /%s?auth=%s HTTP/1.1" 201' % (key, auth))
File "/srv/slapgrid/slappart0/srv/testnode/bvi/inst/test0-0/parts/kedifa/kedifa/test.py", line 319, in assertLastLogEntry
entry in last_log_line, '%r not found in %r' % (entry, last_log_line))
AssertionError: u'"PUT /93m7ttmr1frp0nb5ktq7g8zlq7ae4mxj?auth=jghrgftcyoded84cg0nzae4wlwd4bobo HTTP/1.1" 201' not found in '2020-09-18 07:55:27,121 - kedifa - INFO - 2001:67c:1254:71:ef45::eda4 - - [18/Sep/2020:05:55:27 +0000] "GET /93m7ttmr1frp0nb5ktq7g8zlq7ae4mxj/generateauth HTTP/1.1" 201 32 "-" "python-requests/2.24.0"\n'

======================================================================
FAIL: test_GET_unsigned_identity (kedifa.test.KedifaIntegrationTest)
----------------------------------------------------------------------
Traceback (most recent call last):
File "/srv/slapgrid/slappart0/srv/testnode/bvi/inst/test0-0/parts/kedifa/kedifa/test.py", line 417, in test_GET_unsigned_identity
self.put()
File "/srv/slapgrid/slappart0/srv/testnode/bvi/inst/test0-0/parts/kedifa/kedifa/test.py", line 904, in put
self.assertLastLogEntry('"PUT /%s?auth=%s HTTP/1.1" 201' % (key, auth))
File "/srv/slapgrid/slappart0/srv/testnode/bvi/inst/test0-0/parts/kedifa/kedifa/test.py", line 319, in assertLastLogEntry
entry in last_log_line, '%r not found in %r' % (entry, last_log_line))
AssertionError: u'"PUT /wads279ze56hauo46zh984wk94xp5auh?auth=bv4u3fo2xhylhkqyd30s3m4zktgdpwvg HTTP/1.1" 201' not found in '2020-09-18 07:56:11,292 - kedifa - INFO - 2001:67c:1254:71:ef45::eda4 - - [18/Sep/2020:05:56:11 +0000] "GET /wads279ze56hauo46zh984wk94xp5auh/generateauth HTTP/1.1" 201 32 "-" "python-requests/2.24.0"\n'

======================================================================
FAIL: test_PUT (kedifa.test.KedifaIntegrationTest)
----------------------------------------------------------------------
Traceback (most recent call last):
File "/srv/slapgrid/slappart0/srv/testnode/bvi/inst/test0-0/parts/kedifa/kedifa/test.py", line 907, in test_PUT
self.put()
File "/srv/slapgrid/slappart0/srv/testnode/bvi/inst/test0-0/parts/kedifa/kedifa/test.py", line 904, in put
self.assertLastLogEntry('"PUT /%s?auth=%s HTTP/1.1" 201' % (key, auth))
File "/srv/slapgrid/slappart0/srv/testnode/bvi/inst/test0-0/parts/kedifa/kedifa/test.py", line 319, in assertLastLogEntry
entry in last_log_line, '%r not found in %r' % (entry, last_log_line))
AssertionError: u'"PUT /ky29qiai4r0dmi21im7wkttjzcfyrzaq?auth=udh5p963fxopf7ghgp22hwu6b65hzdw8 HTTP/1.1" 201' not found in '2020-09-18 07:56:54,929 - kedifa - INFO - 2001:67c:1254:71:ef45::eda4 - - [18/Sep/2020:05:56:54 +0000] "GET /ky29qiai4r0dmi21im7wkttjzcfyrzaq/generateauth HTTP/1.1" 201 32 "-" "python-requests/2.24.0"\n'

======================================================================
FAIL: test_PUT_multiple_different_reference (kedifa.test.KedifaIntegrationTest)
----------------------------------------------------------------------
Traceback (most recent call last):
File "/srv/slapgrid/slappart0/srv/testnode/bvi/inst/test0-0/parts/kedifa/kedifa/test.py", line 920, in test_PUT_multiple_different_reference
self.put()
File "/srv/slapgrid/slappart0/srv/testnode/bvi/inst/test0-0/parts/kedifa/kedifa/test.py", line 904, in put
self.assertLastLogEntry('"PUT /%s?auth=%s HTTP/1.1" 201' % (key, auth))
File "/srv/slapgrid/slappart0/srv/testnode/bvi/inst/test0-0/parts/kedifa/kedifa/test.py", line 319, in assertLastLogEntry
entry in last_log_line, '%r not found in %r' % (entry, last_log_line))
AssertionError: u'"PUT /rpmc808ukt8wuauf1k3iyxglsj0tqpx8?auth=n22j587drjuwomys9ydqrsjhp1jqut9k HTTP/1.1" 201' not found in '2020-09-18 08:00:10,572 - kedifa - INFO - 2001:67c:1254:71:ef45::eda4 - - [18/Sep/2020:06:00:10 +0000] "GET /rpmc808ukt8wuauf1k3iyxglsj0tqpx8/generateauth HTTP/1.1" 201 32 "-" "python-requests/2.24.0"\n'

----------------------------------------------------------------------
Ran 76 tests in 869.063s

FAILED (failures=8, errors=1, skipped=1)
Test failed: <unittest.runner.TextTestResult run=76 errors=1 failures=8>
error: Test failed: <unittest.runner.TextTestResult run=76 errors=1 failures=8>