VIFIB DESCENTRALIZED CLOUD COMPUTING

SlapOS is a decentralized Cloud Computing technology that can automate the deployment and configuration of applications in a heterogeneous environment.
kedifa
183.832
76
0
4
1
FAILED
Completed
SLAPOS_TEST_LOG_DIRECTORY=/srv/slapgrid/slappart9/var/log/testnode/bvi-OjNI4vkUC0 SLAPOS_TEST_SHARED_PART_LIST=/srv/slapgrid/slappart9/srv/shared:/srv/slapgrid/slappart9/srv/testnode/bvi/shared /srv/slapgrid/slappart9/srv/testnode/bvi/soft/65dbbd3d11daa99cf78c9566a0a4798e/bin/python_for_test setup.py test
Warning: build in /srv/slapgrid/slappart9/srv/testnode/bvi/soft/65dbbd3d11daa99cf78c9566a0a4798e/parts/kedifa-repository is using versioneer.py from /srv/slapgrid/slappart9/srv/testnode/bvi/inst/test0-0/parts/kedifa/versioneer.py
running test
running egg_info
creating kedifa.egg-info
writing requirements to kedifa.egg-info/requires.txt
writing kedifa.egg-info/PKG-INFO
writing top-level names to kedifa.egg-info/top_level.txt
writing dependency_links to kedifa.egg-info/dependency_links.txt
writing entry points to kedifa.egg-info/entry_points.txt
writing manifest file 'kedifa.egg-info/SOURCES.txt'
reading manifest file 'kedifa.egg-info/SOURCES.txt'
reading manifest template 'MANIFEST.in'
writing manifest file 'kedifa.egg-info/SOURCES.txt'
running build_ext
7928574590489105983 was (originally) automatically approved
8625145824582341928 was (originally) automatically approved
7676016793591050925 was (originally) automatically approved
3065626365941077960 was (originally) automatically approved
u'https://[2001:67c:1254:44:b176::bade]:39231/0wh14qt3jac8ipqvn6mrxvhhqrc9rqxnMISSING' not downloaded, HTTP code 404
3049984229654319314 was (originally) automatically approved
8036486677168586084 was (originally) automatically approved
7324000553335656899 was (originally) automatically approved
5580815502365894798 was (originally) automatically approved
Certificate '/tmp/tmpJMEXzx/tmpmVrdfV': 'https://[2001:67c:1254:44:b176::bade]:48639/5j5omkhyaj8wn658babwrzp70rccziepMISSING' not downloaded, HTTP code 404
2774692939460289011 was (originally) automatically approved
7801564811677095627 was (originally) automatically approved
407104366165441991 was (originally) automatically approved
5411740289224631371 was (originally) automatically approved
2550931736352643843 was (originally) automatically approved
4309115736496815363 was (originally) automatically approved
8592264899673538726 was (originally) automatically approved
743044856028911262 was (originally) automatically approved
u'https://[2001:67c:1254:44:b176::bade]:45029/rrurumcsbidflpctga91z408cblowz4l' not downloaded, problem HTTPSConnectionPool(host='2001:67c:1254:44:b176::bade', port=45029): Max retries exceeded with url: /rrurumcsbidflpctga91z408cblowz4l (Caused by SSLError(SSLError(1, u'[SSL: TLSV1_ALERT_UNKNOWN_CA] tlsv1 alert unknown ca (_ssl.c:1946)'),))
6800961408519879291 was (originally) automatically approved
8186220201944841797 was (originally) automatically approved
8978801513443703400 was (originally) automatically approved
5935510456929854815 was (originally) automatically approved
283168800791044155 was (originally) automatically approved
6089895342950034173 was (originally) automatically approved
1270649806786094956 was (originally) automatically approved
1844858991773467060 was (originally) automatically approved
282904594497676257 was (originally) automatically approved
5415187841860563436 was (originally) automatically approved
8171269573060742125 was (originally) automatically approved
8003335553883307134 was (originally) automatically approved
5111938181352168009 was (originally) automatically approved
1555001171858598443 was (originally) automatically approved
7522998507778586760 was (originally) automatically approved
6333257807217415502 was (originally) automatically approved
9120768409928707657 was (originally) automatically approved
7419635034514769093 was (originally) automatically approved
5024393569633138886 was (originally) automatically approved
4899900716726798001 was (originally) automatically approved
7683924819141798084 was (originally) automatically approved
4746065812076993508 was (originally) automatically approved
443452523933720072 was (originally) automatically approved
972373341659971689 was (originally) automatically approved
8235622977162164900 was (originally) automatically approved
3346890989474108804 was (originally) automatically approved
Certificate '/tmp/tmpo4eEJl/tmp1NtLQq': problem with 'https://[2001:67c:1254:44:b176::bade]:56543/5zsqavak5fnp5s6bngzffqeolzc1pyqf' not downloaded: ('Connection aborted.', error(104, 'Connection reset by peer'))
3394633157390452503 was (originally) automatically approved
2240608656371108015 was (originally) automatically approved
3299985700307775085 was (originally) automatically approved
7759291127842834598 was (originally) automatically approved
8244244092668466851 was (originally) automatically approved
5073394883215910610 was (originally) automatically approved
957627566805699907 was (originally) automatically approved
8150395453656408892 was (originally) automatically approved
8896778071795251721 was (originally) automatically approved
8955074330167843806 was (originally) automatically approved
694484822926310564 was (originally) automatically approved
2687921611680095935 was (originally) automatically approved
7527277633853669716 was (originally) automatically approved
6214565294058094305 was (originally) automatically approved
2760003441303562755 was (originally) automatically approved
3748357050544476356 was (originally) automatically approved
7673885133504923773 was (originally) automatically approved
4380840760851354981 was (originally) automatically approved
6281174275813450754 was (originally) automatically approved
6822654546644229235 was (originally) automatically approved
195493792247206910 was (originally) automatically approved
808712964590758921 was (originally) automatically approved
2275317054229359860 was (originally) automatically approved
6111670452661037735 was (originally) automatically approved
355022532409410226 was (originally) automatically approved
7749801821092260121 was (originally) automatically approved
2793094024544759741 was (originally) automatically approved
7511024860509529963 was (originally) automatically approved
Sleeping for 1s
Couldn't lock '/tmp/tmpErq0Ub/tmpWzW795.lock'
...exiting.
Line 'buzz' is incorrect
Prepare: Used '/tmp/tmp9tSLK6/tmpCO2BdD' for '/tmp/tmp9tSLK6/tmpxxj9Jh'
Prepare: Used '/tmp/tmpaHBAC0/tmpgapMxM' for '/tmp/tmpaHBAC0/tmp6HArVq'
Prepare: Used '/tmp/tmpRP1jLQ/tmppUCfru' for '/tmp/tmpRP1jLQ/tmpiMUqD7'
Certificate '/tmp/tmpZihgri/tmp3zI8rl': updated from 'http://example.com'
Certificate '/tmp/tmpQ9hmwu/tmpcH_KkA': updated from 'http://example.com'
Certificate '/tmp/tmpr0d4Ou/tmpGjkwyy': updated from 'http://example.com'
Certificate '/tmp/tmpABY9Oj/tmpApEdlm': updated from 'http://example.com'
Certificate '/tmp/tmpicYvwY/tmp1XQH1A': updated from 'http://example.com'
Certificate '/tmp/tmpMOzYwF/tmphKkYp_': updated from 'http://example.com'
Certificate '/tmp/tmpXZdg2i/tmpuSmwnn': updated from 'http://example.com'
Certificate '/tmp/tmpCQtQPA/tmphN91b9': updated from 'http://example.com'
Certificate '/tmp/tmpOQDGZa/tmpW61b1o': updated from 'http://example.com'
Certificate '/tmp/tmpIRyTC9/tmpYRZUcB': updated from 'http://example.com'
Certificate '/tmp/tmpITwUcB/tmpnWwFZD': updated from 'http://example.com'
Certificate '/tmp/tmpWIRAbz/tmpT0wWhV': updated from '/master/certificate/file'
Certificate '/tmp/tmpQ299bI/tmpwoWrul': updated from 'http://example.com'
WARNING: Testing via this command is deprecated and will be removed in a future version. Users looking for a generic test entry point independent of test runner are encouraged to use tox.
test_GET_cleanCertificate (kedifa.test.KedifaIntegrationTest) ... ERROR
test_GET_existing (kedifa.test.KedifaIntegrationTest) ... ERROR
test_GET_existing_exact (kedifa.test.KedifaIntegrationTest) ... ERROR
test_GET_existing_getter (kedifa.test.KedifaIntegrationTest) ... Listening on [2001:67c:1254:44:b176::bade]:42965-42966
ok
test_GET_existing_getter_name_does_not_match (kedifa.test.KedifaIntegrationTest) ... Listening on [2001:67c:1254:44:b176::bade]:45651-45652
ok
test_GET_existing_no_identity (kedifa.test.KedifaIntegrationTest) ... Listening on [2001:67c:1254:44:b176::bade]:42815-42816
ok
test_GET_existing_updater (kedifa.test.KedifaIntegrationTest) ... Listening on [2001:67c:1254:44:b176::bade]:41103-41104
ERROR
test_GET_existing_updater_name_does_not_match (kedifa.test.KedifaIntegrationTest) ... Listening on [2001:67c:1254:44:b176::bade]:51183-51184
ok
test_GET_expired (kedifa.test.KedifaIntegrationTest) ... Listening on [2001:67c:1254:44:b176::bade]:33907-33908
ok
test_GET_expired_identity (kedifa.test.KedifaIntegrationTest) ... skipped 'Hard to implement, and already being partially covered by test_GET_revoked_identity'
test_GET_generateauth (kedifa.test.KedifaIntegrationTest) ... Listening on [2001:67c:1254:44:b176::bade]:42389-42390
ok
test_GET_generateauth_no_reserved (kedifa.test.KedifaIntegrationTest) ... Listening on [2001:67c:1254:44:b176::bade]:42313-42314
ok
test_GET_getter_unsigned_identity (kedifa.test.KedifaIntegrationTest) ... Listening on [2001:67c:1254:44:b176::bade]:52859-52860
ok
test_GET_invalid_yet (kedifa.test.KedifaIntegrationTest) ... Listening on [2001:67c:1254:44:b176::bade]:37421-37422
ok
test_GET_list (kedifa.test.KedifaIntegrationTest) ... Listening on [2001:67c:1254:44:b176::bade]:37547-37548
ok
test_GET_list_cleanCertificate (kedifa.test.KedifaIntegrationTest) ... Listening on [2001:67c:1254:44:b176::bade]:39691-39692
ok
test_GET_list_empty (kedifa.test.KedifaIntegrationTest) ... Listening on [2001:67c:1254:44:b176::bade]:39647-39648
ok
test_GET_list_no_identity (kedifa.test.KedifaIntegrationTest) ... Listening on [2001:67c:1254:44:b176::bade]:59105-59106
ok
test_GET_new_server_ca (kedifa.test.KedifaIntegrationTest) ... Listening on [2001:67c:1254:44:b176::bade]:48543-48544
Listening on [2001:67c:1254:44:b176::bade]:39137-39138
ok
test_GET_not_existing (kedifa.test.KedifaIntegrationTest) ... Listening on [2001:67c:1254:44:b176::bade]:41213-41214
ok
test_GET_order (kedifa.test.KedifaIntegrationTest) ... Listening on [2001:67c:1254:44:b176::bade]:54775-54776
ok
test_GET_revoked_identity (kedifa.test.KedifaIntegrationTest) ... Listening on [2001:67c:1254:44:b176::bade]:37047-37048
ok
test_GET_root (kedifa.test.KedifaIntegrationTest) ... Listening on [2001:67c:1254:44:b176::bade]:47333-47334
ok
test_GET_unsigned_identity (kedifa.test.KedifaIntegrationTest) ... Listening on [2001:67c:1254:44:b176::bade]:59941-59942
ok
test_GET_updater_unsigned_identity (kedifa.test.KedifaIntegrationTest) ... Listening on [2001:67c:1254:44:b176::bade]:53613-53614
ok
test_PUT (kedifa.test.KedifaIntegrationTest) ... Listening on [2001:67c:1254:44:b176::bade]:56123-56124
ok
test_PUT_bad (kedifa.test.KedifaIntegrationTest) ... Listening on [2001:67c:1254:44:b176::bade]:56519-56520
ok
test_PUT_bad_auth (kedifa.test.KedifaIntegrationTest) ... Listening on [2001:67c:1254:44:b176::bade]:49899-49900
ok
test_PUT_certificate_expired (kedifa.test.KedifaIntegrationTest) ... Listening on [2001:67c:1254:44:b176::bade]:39375-39376
ok
test_PUT_certificate_key_mismatch (kedifa.test.KedifaIntegrationTest) ... Listening on [2001:67c:1254:44:b176::bade]:57481-57482
ok
test_PUT_certificate_not_valid_yet (kedifa.test.KedifaIntegrationTest) ... Listening on [2001:67c:1254:44:b176::bade]:36785-36786
ok
test_PUT_certificate_only (kedifa.test.KedifaIntegrationTest) ... Listening on [2001:67c:1254:44:b176::bade]:49063-49064
ok
test_PUT_key_before_certificate (kedifa.test.KedifaIntegrationTest) ... Listening on [2001:67c:1254:44:b176::bade]:43823-43824
ok
test_PUT_key_only (kedifa.test.KedifaIntegrationTest) ... Listening on [2001:67c:1254:44:b176::bade]:52613-52614
ok
test_PUT_multiple_different_reference (kedifa.test.KedifaIntegrationTest) ... Listening on [2001:67c:1254:44:b176::bade]:59469-59470
ok
test_PUT_multiple_same_reference (kedifa.test.KedifaIntegrationTest) ... Listening on [2001:67c:1254:44:b176::bade]:38371-38372
ok
test_PUT_no_auth (kedifa.test.KedifaIntegrationTest) ... Listening on [2001:67c:1254:44:b176::bade]:46731-46732
ok
test_bad_query_string (kedifa.test.KedifaIntegrationTest) ... Listening on [2001:67c:1254:44:b176::bade]:41565-41566
ok
test_reload_log (kedifa.test.KedifaIntegrationTest) ... Listening on [2001:67c:1254:44:b176::bade]:47169-47170
ok
test (kedifa.test.KedifaUpdaterLoopTest) ... ok
test_infinite (kedifa.test.KedifaUpdaterLoopTest) ... ok
test_lock (kedifa.test.KedifaUpdaterLoopTest) ... ok
test_raises (kedifa.test.KedifaUpdaterLoopTest) ... ok
test_updateMapping_empty (kedifa.test.KedifaUpdaterMappingTest) ... ok
test_updateMapping_morewhite (kedifa.test.KedifaUpdaterMappingTest) ... ok
test_updateMapping_normal (kedifa.test.KedifaUpdaterMappingTest) ... ok
test_updateMapping_one_comment (kedifa.test.KedifaUpdaterMappingTest) ... ok
test_updateMapping_one_empty (kedifa.test.KedifaUpdaterMappingTest) ... ok
test_updateMapping_one_not_enough (kedifa.test.KedifaUpdaterMappingTest) ... ok
test_updateMapping_with_fallback (kedifa.test.KedifaUpdaterMappingTest) ... ok
test_cert_master_fallback (kedifa.test.KedifaUpdaterUpdateCertificatePrepareTest) ... ok
test_cert_master_nofallback (kedifa.test.KedifaUpdaterUpdateCertificatePrepareTest) ... ok
test_cert_nomaster_fallback (kedifa.test.KedifaUpdaterUpdateCertificatePrepareTest) ... ok
test_cert_nomaster_nofallback (kedifa.test.KedifaUpdaterUpdateCertificatePrepareTest) ... ok
test_nocert_master_fallback (kedifa.test.KedifaUpdaterUpdateCertificatePrepareTest) ... ok
test_nocert_master_nofallback (kedifa.test.KedifaUpdaterUpdateCertificatePrepareTest) ... ok
test_nocert_nomaster_fallback (kedifa.test.KedifaUpdaterUpdateCertificatePrepareTest) ... ok
test_nocert_nomaster_nofallback (kedifa.test.KedifaUpdaterUpdateCertificatePrepareTest) ... ok
test_cert_fetch_master_fallback (kedifa.test.KedifaUpdaterUpdateCertificateTest) ... ok
test_cert_fetch_master_nofallback (kedifa.test.KedifaUpdaterUpdateCertificateTest) ... ok
test_cert_fetch_nomaster_fallback (kedifa.test.KedifaUpdaterUpdateCertificateTest) ... ok
test_cert_fetch_nomaster_nofallback (kedifa.test.KedifaUpdaterUpdateCertificateTest) ... ok
test_cert_nofetch_master_fallback (kedifa.test.KedifaUpdaterUpdateCertificateTest) ... ok
test_cert_nofetch_master_fallback_overridden (kedifa.test.KedifaUpdaterUpdateCertificateTest) ... ok
test_cert_nofetch_master_nofallback (kedifa.test.KedifaUpdaterUpdateCertificateTest) ... ok
test_cert_nofetch_nomaster_fallback (kedifa.test.KedifaUpdaterUpdateCertificateTest) ... ok
test_cert_nofetch_nomaster_fallback_overridden (kedifa.test.KedifaUpdaterUpdateCertificateTest) ... ok
test_cert_nofetch_nomaster_nofallback (kedifa.test.KedifaUpdaterUpdateCertificateTest) ... ok
test_nocert_fetch_master_fallback (kedifa.test.KedifaUpdaterUpdateCertificateTest) ... ok
test_nocert_fetch_master_nofallback (kedifa.test.KedifaUpdaterUpdateCertificateTest) ... ok
test_nocert_fetch_nomaster_fallback (kedifa.test.KedifaUpdaterUpdateCertificateTest) ... ok
test_nocert_fetch_nomaster_nofallback (kedifa.test.KedifaUpdaterUpdateCertificateTest) ... ok
test_nocert_nofetch_master_fallback (kedifa.test.KedifaUpdaterUpdateCertificateTest) ... ok
test_nocert_nofetch_master_nofallback (kedifa.test.KedifaUpdaterUpdateCertificateTest) ... ok
test_nocert_nofetch_nomaster_fallback (kedifa.test.KedifaUpdaterUpdateCertificateTest) ... ok
test_nocert_nofetch_nomaster_nofallback (kedifa.test.KedifaUpdaterUpdateCertificateTest) ... ok

======================================================================
ERROR: test_GET_cleanCertificate (kedifa.test.KedifaIntegrationTest)
----------------------------------------------------------------------
Traceback (most recent call last):
File "/srv/slapgrid/slappart9/srv/testnode/bvi/inst/test0-0/parts/kedifa/kedifa/test.py", line 290, in setUp
self.setUpCaucase()
File "/srv/slapgrid/slappart9/srv/testnode/bvi/inst/test0-0/parts/kedifa/kedifa/test.py", line 172, in setUpCaucase
'Caucase not available after %.2fs seconds' % (time.time() - b))
AssertionError: Caucase not available after 5.15s seconds

======================================================================
ERROR: test_GET_existing (kedifa.test.KedifaIntegrationTest)
----------------------------------------------------------------------
Traceback (most recent call last):
File "/srv/slapgrid/slappart9/srv/testnode/bvi/inst/test0-0/parts/kedifa/kedifa/test.py", line 290, in setUp
self.setUpCaucase()
File "/srv/slapgrid/slappart9/srv/testnode/bvi/inst/test0-0/parts/kedifa/kedifa/test.py", line 172, in setUpCaucase
'Caucase not available after %.2fs seconds' % (time.time() - b))
AssertionError: Caucase not available after 5.12s seconds

======================================================================
ERROR: test_GET_existing_exact (kedifa.test.KedifaIntegrationTest)
----------------------------------------------------------------------
Traceback (most recent call last):
File "/srv/slapgrid/slappart9/srv/testnode/bvi/inst/test0-0/parts/kedifa/kedifa/test.py", line 290, in setUp
self.setUpCaucase()
File "/srv/slapgrid/slappart9/srv/testnode/bvi/inst/test0-0/parts/kedifa/kedifa/test.py", line 172, in setUpCaucase
'Caucase not available after %.2fs seconds' % (time.time() - b))
AssertionError: Caucase not available after 5.13s seconds

======================================================================
ERROR: test_GET_existing_updater (kedifa.test.KedifaIntegrationTest)
----------------------------------------------------------------------
Traceback (most recent call last):
File "/srv/slapgrid/slappart9/srv/testnode/bvi/inst/test0-0/parts/kedifa/kedifa/test.py", line 290, in setUp
self.setUpCaucase()
File "/srv/slapgrid/slappart9/srv/testnode/bvi/inst/test0-0/parts/kedifa/kedifa/test.py", line 172, in setUpCaucase
'Caucase not available after %.2fs seconds' % (time.time() - b))
AssertionError: Caucase not available after 5.14s seconds

----------------------------------------------------------------------
Ran 76 tests in 183.832s

FAILED (errors=4, skipped=1)
Test failed: <unittest.runner.TextTestResult run=76 errors=4 failures=0>
error: Test failed: <unittest.runner.TextTestResult run=76 errors=4 failures=0>