VIFIB DESCENTRALIZED CLOUD COMPUTING

SlapOS is a decentralized Cloud Computing technology that can automate the deployment and configuration of applications in a heterogeneous environment.
kvm
5 672.787
33
0
1
4
FAILED
Completed
SLAPOS_TEST_LOG_DIRECTORY=/srv/slapgrid/slappart9/var/log/testnode/cvr-LnUSGcdqKK SLAPOS_TEST_SHARED_PART_LIST=/srv/slapgrid/slappart9/srv/shared:/srv/slapgrid/slappart9/srv/testnode/cvr/shared /srv/slapgrid/slappart9/srv/testnode/cvr/soft/ae7ffc5e56b55ad22db74d88b36303a1/bin/python_for_test setup.py test
running test
running egg_info
writing slapos.test.kvm.egg-info/PKG-INFO
writing dependency_links to slapos.test.kvm.egg-info/dependency_links.txt
writing requirements to slapos.test.kvm.egg-info/requires.txt
writing top-level names to slapos.test.kvm.egg-info/top_level.txt
reading manifest file 'slapos.test.kvm.egg-info/SOURCES.txt'
writing manifest file 'slapos.test.kvm.egg-info/SOURCES.txt'
running build_ext
WARNING: Testing via this command is deprecated and will be removed in a future version. Users looking for a generic test entry point independent of test runner are encouraged to use tox.
Removing $PYTHONPATH from environment for subprocess
test_hashes (test.ServicesTestCase) ... ok
Removing $PYTHONPATH from environment for subprocess
test (test.TestAccessDefault) ... /srv/slapgrid/slappart9/srv/testnode/cvr/soft/ae7ffc5e56b55ad22db74d88b36303a1/eggs/urllib3-1.24.1-py3.7.egg/urllib3/connectionpool.py:847: InsecureRequestWarning: Unverified HTTPS request is being made. Adding certificate verification is strongly advised. See: https://urllib3.readthedocs.io/en/latest/advanced-usage.html#ssl-warnings
InsecureRequestWarning)
ok
test_access_monitor (test.TestAccessDefault) ... ok
Removing $PYTHONPATH from environment for subprocess
test (test.TestAccessDefaultAdditional) ... /srv/slapgrid/slappart9/srv/testnode/cvr/soft/ae7ffc5e56b55ad22db74d88b36303a1/eggs/urllib3-1.24.1-py3.7.egg/urllib3/connectionpool.py:847: InsecureRequestWarning: Unverified HTTPS request is being made. Adding certificate verification is strongly advised. See: https://urllib3.readthedocs.io/en/latest/advanced-usage.html#ssl-warnings
InsecureRequestWarning)
ok
test_access_monitor (test.TestAccessDefaultAdditional) ... ok
Removing $PYTHONPATH from environment for subprocess
test (test.TestAccessDefaultBootstrap) ... /srv/slapgrid/slappart9/srv/testnode/cvr/soft/ae7ffc5e56b55ad22db74d88b36303a1/eggs/urllib3-1.24.1-py3.7.egg/urllib3/connectionpool.py:847: InsecureRequestWarning: Unverified HTTPS request is being made. Adding certificate verification is strongly advised. See: https://urllib3.readthedocs.io/en/latest/advanced-usage.html#ssl-warnings
InsecureRequestWarning)
ok
test_access_monitor (test.TestAccessDefaultBootstrap) ... ok
Removing $PYTHONPATH from environment for subprocess
test (test.TestAccessKvmCluster) ... /srv/slapgrid/slappart9/srv/testnode/cvr/soft/ae7ffc5e56b55ad22db74d88b36303a1/eggs/urllib3-1.24.1-py3.7.egg/urllib3/connectionpool.py:847: InsecureRequestWarning: Unverified HTTPS request is being made. Adding certificate verification is strongly advised. See: https://urllib3.readthedocs.io/en/latest/advanced-usage.html#ssl-warnings
InsecureRequestWarning)
ok
test_access_monitor (test.TestAccessKvmCluster) ... ok
The following partitions were not cleaned up: ['akc1']
Removing $PYTHONPATH from environment for subprocess
test (test.TestAccessKvmClusterAdditional) ... /srv/slapgrid/slappart9/srv/testnode/cvr/soft/ae7ffc5e56b55ad22db74d88b36303a1/eggs/urllib3-1.24.1-py3.7.egg/urllib3/connectionpool.py:847: InsecureRequestWarning: Unverified HTTPS request is being made. Adding certificate verification is strongly advised. See: https://urllib3.readthedocs.io/en/latest/advanced-usage.html#ssl-warnings
InsecureRequestWarning)
ok
test_access_monitor (test.TestAccessKvmClusterAdditional) ... ok
The following partitions were not cleaned up: ['akca1']
test (test.TestAccessKvmClusterBootstrap) ... skipped 'rdiff-backup is not compatible with Python 3 yet'
test_access_monitor (test.TestAccessKvmClusterBootstrap) ... skipped 'rdiff-backup is not compatible with Python 3 yet'
test (test.TestAccessResilientAdditional) ... skipped 'rdiff-backup is not compatible with Python 3 yet'
Removing $PYTHONPATH from environment for subprocess
test (test.TestBootImageUrlList) ... ERROR
test_bad_parameter (test.TestBootImageUrlList) ... 2020-09-17 01:17:53,304 - Monitor - INFO - Checking promises...
2020-09-17 01:17:53,306 - Monitor - INFO - Checking promise boot-image-url-list-config-state-promise.py...
2020-09-17 01:17:53,507 - Monitor - ERROR - ERROR '/srv/slapgrid/slappart9/srv/testnode/cvr/inst/test0-0/tmp/inst/biul0/srv/monitor/private/boot-image-url-list/boot-image-url-list-json-config-error.txt' not empty, content available at https://[2001:67c:1254:71:ef45::2d39]:8026/private/boot-image-url-list/boot-image-url-list-json-config-error.txt with username admin and password twyzjokm
2020-09-17 01:17:53,509 - Monitor - INFO - Finished promises.
ok
test_incorrect_md5sum (test.TestBootImageUrlList) ... 2020-09-17 01:19:15,431 - Monitor - INFO - Checking promises...
2020-09-17 01:19:15,433 - Monitor - INFO - Checking promise boot-image-url-list-config-state-promise.py...
2020-09-17 01:19:15,685 - Monitor - ERROR - ERROR '/srv/slapgrid/slappart9/srv/testnode/cvr/inst/test0-0/tmp/inst/biul0/srv/monitor/private/boot-image-url-list/boot-image-url-list-json-config-error.txt' not empty, content available at https://[2001:67c:1254:71:ef45::2d39]:8026/private/boot-image-url-list/boot-image-url-list-json-config-error.txt with username admin and password twyzjokm
2020-09-17 01:19:15,687 - Monitor - INFO - Finished promises.
2020-09-17 01:19:58,710 - Monitor - INFO - Checking promises...
2020-09-17 01:19:58,712 - Monitor - INFO - Checking promise boot-image-url-list-config-state-promise.py...
2020-09-17 01:19:58,964 - Monitor - ERROR - ERROR '/srv/slapgrid/slappart9/srv/testnode/cvr/inst/test0-0/tmp/inst/biul0/srv/monitor/private/boot-image-url-list/boot-image-url-list-json-config-error.txt' not empty, content available at https://[2001:67c:1254:71:ef45::2d39]:8026/private/boot-image-url-list/boot-image-url-list-json-config-error.txt with username admin and password twyzjokm
2020-09-17 01:19:58,965 - Monitor - INFO - Finished promises.
ok
test_not_matching_md5sum (test.TestBootImageUrlList) ... 2020-09-17 01:21:22,745 - Monitor - INFO - Checking promises...
2020-09-17 01:21:22,747 - Monitor - INFO - Checking promise boot-image-url-list-download-md5sum-promise.py...
2020-09-17 01:21:22,999 - Monitor - ERROR - ERROR '/srv/slapgrid/slappart9/srv/testnode/cvr/inst/test0-0/tmp/inst/biul0/srv/monitor/private/boot-image-url-list/boot-image-url-list-download-controller-md5sum-fail.json' not empty, content available at https://[2001:67c:1254:71:ef45::2d39]:8026/private/boot-image-url-list/boot-image-url-list-download-controller-md5sum-fail.json with username admin and password twyzjokm
2020-09-17 01:21:23,001 - Monitor - INFO - Finished promises.
2020-09-17 01:21:23,520 - Monitor - INFO - Checking promises...
2020-09-17 01:21:23,522 - Monitor - INFO - Checking promise boot-image-url-list-download-state-promise.py...
2020-09-17 01:21:23,774 - Monitor - ERROR - ERROR '/srv/slapgrid/slappart9/srv/testnode/cvr/inst/test0-0/tmp/inst/biul0/srv/monitor/private/boot-image-url-list/boot-image-url-list-download-controller-error.text' not empty, content available at https://[2001:67c:1254:71:ef45::2d39]:8026/private/boot-image-url-list/boot-image-url-list-download-controller-error.text with username admin and password twyzjokm
2020-09-17 01:21:23,775 - Monitor - INFO - Finished promises.
ok
test_too_many_images (test.TestBootImageUrlList) ... 2020-09-17 01:22:47,524 - Monitor - INFO - Checking promises...
2020-09-17 01:22:47,526 - Monitor - INFO - Checking promise boot-image-url-list-config-state-promise.py...
2020-09-17 01:22:47,727 - Monitor - ERROR - ERROR '/srv/slapgrid/slappart9/srv/testnode/cvr/inst/test0-0/tmp/inst/biul0/srv/monitor/private/boot-image-url-list/boot-image-url-list-json-config-error.txt' not empty, content available at https://[2001:67c:1254:71:ef45::2d39]:8026/private/boot-image-url-list/boot-image-url-list-json-config-error.txt with username admin and password twyzjokm
2020-09-17 01:22:47,728 - Monitor - INFO - Finished promises.
ok
test_unreachable_host (test.TestBootImageUrlList) ... 2020-09-17 01:24:00,828 - Monitor - INFO - Checking promises...
2020-09-17 01:24:00,831 - Monitor - INFO - Checking promise boot-image-url-list-download-state-promise.py...
2020-09-17 01:24:01,082 - Monitor - ERROR - ERROR '/srv/slapgrid/slappart9/srv/testnode/cvr/inst/test0-0/tmp/inst/biul0/srv/monitor/private/boot-image-url-list/boot-image-url-list-download-controller-error.text' not empty, content available at https://[2001:67c:1254:71:ef45::2d39]:8026/private/boot-image-url-list/boot-image-url-list-download-controller-error.text with username admin and password twyzjokm
2020-09-17 01:24:01,084 - Monitor - INFO - Finished promises.
ok
Removing $PYTHONPATH from environment for subprocess
test (test.TestBootImageUrlListKvmCluster) ... ok
The following partitions were not cleaned up: ['biulkc1', 'biulkc2']
Removing $PYTHONPATH from environment for subprocess
test (test.TestBootImageUrlSelect) ... ok
test_bad_parameter (test.TestBootImageUrlSelect) ... 2020-09-17 01:30:19,722 - Monitor - INFO - Checking promises...
2020-09-17 01:30:19,724 - Monitor - INFO - Checking promise boot-image-url-select-config-state-promise.py...
2020-09-17 01:30:19,976 - Monitor - ERROR - ERROR '/srv/slapgrid/slappart9/srv/testnode/cvr/inst/test0-0/tmp/inst/bius0/srv/monitor/private/boot-image-url-select/boot-image-url-select-json-config-error.txt' not empty, content available at https://[2001:67c:1254:71:ef45::2d39]:8026/private/boot-image-url-select/boot-image-url-select-json-config-error.txt with username admin and password vactebyp
2020-09-17 01:30:19,977 - Monitor - INFO - Finished promises.
ok
test_incorrect_md5sum (test.TestBootImageUrlSelect) ... 2020-09-17 01:31:41,876 - Monitor - INFO - Checking promises...
2020-09-17 01:31:41,878 - Monitor - INFO - Checking promise boot-image-url-select-config-state-promise.py...
2020-09-17 01:31:42,079 - Monitor - ERROR - ERROR '/srv/slapgrid/slappart9/srv/testnode/cvr/inst/test0-0/tmp/inst/bius0/srv/monitor/private/boot-image-url-select/boot-image-url-select-json-config-error.txt' not empty, content available at https://[2001:67c:1254:71:ef45::2d39]:8026/private/boot-image-url-select/boot-image-url-select-json-config-error.txt with username admin and password vactebyp
2020-09-17 01:31:42,081 - Monitor - INFO - Finished promises.
2020-09-17 01:32:25,109 - Monitor - INFO - Checking promises...
2020-09-17 01:32:25,112 - Monitor - INFO - Checking promise boot-image-url-select-config-state-promise.py...
2020-09-17 01:32:25,363 - Monitor - ERROR - ERROR '/srv/slapgrid/slappart9/srv/testnode/cvr/inst/test0-0/tmp/inst/bius0/srv/monitor/private/boot-image-url-select/boot-image-url-select-json-config-error.txt' not empty, content available at https://[2001:67c:1254:71:ef45::2d39]:8026/private/boot-image-url-select/boot-image-url-select-json-config-error.txt with username admin and password vactebyp
2020-09-17 01:32:25,365 - Monitor - INFO - Finished promises.
ok
test_not_json (test.TestBootImageUrlSelect) ... 2020-09-17 01:33:49,109 - Monitor - INFO - Checking promises...
2020-09-17 01:33:49,111 - Monitor - INFO - Checking promise boot-image-url-select-config-state-promise.py...
2020-09-17 01:33:49,363 - Monitor - ERROR - ERROR '/srv/slapgrid/slappart9/srv/testnode/cvr/inst/test0-0/tmp/inst/bius0/srv/monitor/private/boot-image-url-select/boot-image-url-select-json-config-error.txt' not empty, content available at https://[2001:67c:1254:71:ef45::2d39]:8026/private/boot-image-url-select/boot-image-url-select-json-config-error.txt with username admin and password vactebyp
2020-09-17 01:33:49,364 - Monitor - INFO - Finished promises.
ok
test_not_matching_md5sum (test.TestBootImageUrlSelect) ... 2020-09-17 01:35:13,137 - Monitor - INFO - Checking promises...
2020-09-17 01:35:13,139 - Monitor - INFO - Checking promise boot-image-url-select-download-md5sum-promise.py...
2020-09-17 01:35:13,391 - Monitor - ERROR - ERROR '/srv/slapgrid/slappart9/srv/testnode/cvr/inst/test0-0/tmp/inst/bius0/srv/monitor/private/boot-image-url-select/boot-image-url-select-download-controller-md5sum-fail.json' not empty, content available at https://[2001:67c:1254:71:ef45::2d39]:8026/private/boot-image-url-select/boot-image-url-select-download-controller-md5sum-fail.json with username admin and password vactebyp
2020-09-17 01:35:13,393 - Monitor - INFO - Finished promises.
2020-09-17 01:35:13,903 - Monitor - INFO - Checking promises...
2020-09-17 01:35:13,906 - Monitor - INFO - Checking promise boot-image-url-select-download-state-promise.py...
2020-09-17 01:35:14,157 - Monitor - ERROR - ERROR '/srv/slapgrid/slappart9/srv/testnode/cvr/inst/test0-0/tmp/inst/bius0/srv/monitor/private/boot-image-url-select/boot-image-url-select-download-controller-error.text' not empty, content available at https://[2001:67c:1254:71:ef45::2d39]:8026/private/boot-image-url-select/boot-image-url-select-download-controller-error.text with username admin and password vactebyp
2020-09-17 01:35:14,159 - Monitor - INFO - Finished promises.
ok
test_together (test.TestBootImageUrlSelect) ... ok
test_too_many_images (test.TestBootImageUrlSelect) ... 2020-09-17 01:38:59,155 - Monitor - INFO - Checking promises...
2020-09-17 01:38:59,157 - Monitor - INFO - Checking promise boot-image-url-select-config-state-promise.py...
2020-09-17 01:38:59,408 - Monitor - ERROR - ERROR '/srv/slapgrid/slappart9/srv/testnode/cvr/inst/test0-0/tmp/inst/bius0/srv/monitor/private/boot-image-url-select/boot-image-url-select-json-config-error.txt' not empty, content available at https://[2001:67c:1254:71:ef45::2d39]:8026/private/boot-image-url-select/boot-image-url-select-json-config-error.txt with username admin and password vactebyp
2020-09-17 01:38:59,410 - Monitor - INFO - Finished promises.
ok
test_unreachable_host (test.TestBootImageUrlSelect) ... 2020-09-17 01:40:14,763 - Monitor - INFO - Checking promises...
2020-09-17 01:40:14,766 - Monitor - INFO - Checking promise boot-image-url-select-download-state-promise.py...
2020-09-17 01:40:15,017 - Monitor - ERROR - ERROR '/srv/slapgrid/slappart9/srv/testnode/cvr/inst/test0-0/tmp/inst/bius0/srv/monitor/private/boot-image-url-select/boot-image-url-select-download-controller-error.text' not empty, content available at https://[2001:67c:1254:71:ef45::2d39]:8026/private/boot-image-url-select/boot-image-url-select-download-controller-error.text with username admin and password vactebyp
2020-09-17 01:40:15,019 - Monitor - INFO - Finished promises.
ok
Removing $PYTHONPATH from environment for subprocess
test (test.TestBootImageUrlSelectKvmCluster) ... ok
The following partitions were not cleaned up: ['biuskc1', 'biuskc2']
Removing $PYTHONPATH from environment for subprocess
test (test.TestCpuMemMaxDynamic) ... ok
Removing $PYTHONPATH from environment for subprocess
test (test.TestInstanceNbdServer) ... ok
test (test.TestInstanceResilient) ... skipped 'rdiff-backup is not compatible with Python 3 yet'

======================================================================
ERROR: test (test.TestBootImageUrlList)
----------------------------------------------------------------------
Traceback (most recent call last):
File "/srv/slapgrid/slappart9/srv/testnode/cvr/soft/ae7ffc5e56b55ad22db74d88b36303a1/parts/slapos-repository/software/kvm/test/test.py", line 645, in test
self.slap.waitForInstance(max_retry=1)
File "/srv/slapgrid/slappart9/srv/testnode/cvr/soft/ae7ffc5e56b55ad22db74d88b36303a1/parts/slapos.core-repository/slapos/slap/standalone.py", line 686, in waitForInstance
error_lines=error_lines,
File "/srv/slapgrid/slappart9/srv/testnode/cvr/soft/ae7ffc5e56b55ad22db74d88b36303a1/parts/slapos.core-repository/slapos/slap/standalone.py", line 756, in _runSlapOSCommand
'exitstatus': process_info['exitstatus'],
slapos.slap.standalone.SlapOSNodeCommandError: SlapOSNodeCommandError exitstatus: 2 output:
2020-09-17 01:16:22 slapos[24045] INFO Checking promise monitor-httpd-listening-on-tcp.py...
2020-09-17 01:16:22 monitor-httpd-listening-on-tcp.py[24045] INFO 'https://[2001:67c:1254:71:ef45::2d39]:8026' is protected (returned 401).
2020-09-17 01:16:22 slapos[24045] INFO Checking promise monitor-bootstrap-status.py...
2020-09-17 01:16:22 monitor-bootstrap-status.py[24045] INFO Bootstrap OK
2020-09-17 01:16:22 slapos[24045] INFO Checking promise buildout-biul0-status.py...
2020-09-17 01:16:23 buildout-biul0-status.py[24045] INFO buildout is OK
2020-09-17 01:16:23 slapos[24045] INFO Checking promise vnc_promise.py...
2020-09-17 01:16:23 vnc_promise.py[24045] INFO port connection OK (('10.0.109.16', 5901))
2020-09-17 01:16:23 slapos[24045] INFO Checking promise novnc_promise.py...
2020-09-17 01:16:23 novnc_promise.py[24045] INFO port connection OK (('2001:67c:1254:71:ef45::2d39', 6080))
2020-09-17 01:16:23 slapos[24045] INFO Checking promise qemu-virtual-machine-is-ready.py...
2020-09-17 01:16:25 qemu-virtual-machine-is-ready.py[24045] INFO OK '/srv/slapgrid/slappart9/srv/testnode/cvr/inst/test0-0/tmp/inst/biul0/bin/qemu-virtual-machine-is-ready' run with success
2020-09-17 01:16:25 slapos[24045] INFO Checking promise kvm-disk-image-corruption.py...
2020-09-17 01:16:25 kvm-disk-image-corruption.py[24045] INFO OK '/srv/slapgrid/slappart9/srv/testnode/cvr/inst/test0-0/tmp/inst/biul0/bin/kvm-disk-image-corruption' run with success
2020-09-17 01:16:26 slapos[24045] INFO Checking promise frontend_promise.py...
2020-09-17 01:16:26 frontend_promise.py[24045] INFO 'https://[2001:67c:1254:71:ef45::2d39]:6080/vnc.html?auto=1&encrypt=1&password=wxhncgdp' is available
2020-09-17 01:16:26 slapos[24045] INFO Checking promise boot-image-url-list-config-state-promise.py...
2020-09-17 01:16:26 boot-image-url-list-config-state-promise.py[24045] INFO OK '/srv/slapgrid/slappart9/srv/testnode/cvr/inst/test0-0/tmp/inst/biul0/srv/monitor/private/boot-image-url-list/boot-image-url-list-json-config-error.txt' state 'empty'
2020-09-17 01:16:26 slapos[24045] INFO Checking promise boot-image-url-list-download-md5sum-promise.py...
2020-09-17 01:16:26 boot-image-url-list-download-md5sum-promise.py[24045] INFO OK '/srv/slapgrid/slappart9/srv/testnode/cvr/inst/test0-0/tmp/inst/biul0/srv/monitor/private/boot-image-url-list/boot-image-url-list-download-controller-md5sum-fail.json' state 'empty'
2020-09-17 01:16:26 slapos[24045] INFO Checking promise boot-image-url-list-download-state-promise.py...
2020-09-17 01:16:26 boot-image-url-list-download-state-promise.py[24045] INFO OK '/srv/slapgrid/slappart9/srv/testnode/cvr/inst/test0-0/tmp/inst/biul0/srv/monitor/private/boot-image-url-list/boot-image-url-list-download-controller-error.text' state 'empty'
2020-09-17 01:16:26 slapos[24045] INFO Checking promise boot-image-url-list-processed-config-promise.py...
2020-09-17 01:16:27 boot-image-url-list-processed-config-promise.py[24045] ERROR ERROR '/srv/slapgrid/slappart9/srv/testnode/cvr/inst/test0-0/tmp/inst/biul0/srv/monitor/private/boot-image-url-list/boot-image-url-list-processed-config.state' not empty, content available at https://[2001:67c:1254:71:ef45::2d39]:8026/private/boot-image-url-list/boot-image-url-list-processed-config.state with username admin and password twyzjokm
2020-09-17 01:16:27 slapos[24045] ERROR ERROR '/srv/slapgrid/slappart9/srv/testnode/cvr/inst/test0-0/tmp/inst/biul0/srv/monitor/private/boot-image-url-list/boot-image-url-list-processed-config.state' not empty, content available at https://[2001:67c:1254:71:ef45::2d39]:8026/private/boot-image-url-list/boot-image-url-list-processed-config.state with username admin and password twyzjokm
2020-09-17 01:16:27 slapos[24045] ERROR Promise 'boot-image-url-list-processed-config-promise.py' failed with output: ERROR '/srv/slapgrid/slappart9/srv/testnode/cvr/inst/test0-0/tmp/inst/biul0/srv/monitor/private/boot-image-url-list/boot-image-url-list-processed-config.state' not empty, content available at https://[2001:67c:1254:71:ef45::2d39]:8026/private/boot-image-url-list/boot-image-url-list-processed-config.state with username admin and password twyzjokm
2020-09-17 01:16:27 slapos[24045] INFO Finished computer partitions.
2020-09-17 01:16:27 slapos[24045] INFO ================================================================================
2020-09-17 01:16:27 slapos[24045] INFO Error with promises for the following partitions:
2020-09-17 01:16:27 slapos[24045] INFO biul0[default]: Promise 'boot-image-url-list-processed-config-promise.py' failed with output: ERROR '/srv/slapgrid/slappart9/srv/testnode/cvr/inst/test0-0/tmp/inst/biul0/srv/monitor/private/boot-image-url-list/boot-image-url-list-processed-config.state' not empty, content available at https://[2001:67c:1254:71:ef45::2d39]:8026/private/boot-image-url-list/boot-image-url-list-processed-config.state with username admin and password twyzjokm

----------------------------------------------------------------------
Ran 33 tests in 5672.787s

FAILED (errors=1, skipped=4)
Test failed: <unittest.runner.TextTestResult run=33 errors=1 failures=0>
error: Test failed: <unittest.runner.TextTestResult run=33 errors=1 failures=0>