VIFIB DESCENTRALIZED CLOUD COMPUTING

SlapOS is a decentralized Cloud Computing technology that can automate the deployment and configuration of applications in a heterogeneous environment.
kedifa
174.322
76
0
1
1
FAILED
Completed
SLAPOS_TEST_LOG_DIRECTORY=/srv/slapgrid/slappart9/var/log/testnode/bvi-uFcAz47dGX SLAPOS_TEST_SHARED_PART_LIST=/srv/slapgrid/slappart9/srv/shared:/srv/slapgrid/slappart9/srv/testnode/bvi/shared /srv/slapgrid/slappart9/srv/testnode/bvi/soft/65dbbd3d11daa99cf78c9566a0a4798e/bin/python_for_test setup.py test
Warning: build in /srv/slapgrid/slappart9/srv/testnode/bvi/soft/65dbbd3d11daa99cf78c9566a0a4798e/parts/kedifa-repository is using versioneer.py from /srv/slapgrid/slappart9/srv/testnode/bvi/inst/test0-0/parts/kedifa/versioneer.py
running test
running egg_info
creating kedifa.egg-info
writing requirements to kedifa.egg-info/requires.txt
writing kedifa.egg-info/PKG-INFO
writing top-level names to kedifa.egg-info/top_level.txt
writing dependency_links to kedifa.egg-info/dependency_links.txt
writing entry points to kedifa.egg-info/entry_points.txt
writing manifest file 'kedifa.egg-info/SOURCES.txt'
reading manifest file 'kedifa.egg-info/SOURCES.txt'
reading manifest template 'MANIFEST.in'
writing manifest file 'kedifa.egg-info/SOURCES.txt'
running build_ext
8310213453257445609 was (originally) automatically approved
7940214638164524901 was (originally) automatically approved
7608838025776016060 was (originally) automatically approved
8334187047401651119 was (originally) automatically approved
4908331119534521151 was (originally) automatically approved
8384590231996160739 was (originally) automatically approved
5844077679219208952 was (originally) automatically approved
4334461018238501703 was (originally) automatically approved
8593894434374280828 was (originally) automatically approved
5159069023718657947 was (originally) automatically approved
u'https://[2001:67c:1254:44:b176::bade]:52259/vhmzt4lli8t78911nme1br9cfvpnukb6MISSING' not downloaded, HTTP code 404
6987867616972827004 was (originally) automatically approved
2024466892275527256 was (originally) automatically approved
4143995787222302840 was (originally) automatically approved
6041373951673908124 was (originally) automatically approved
Certificate '/tmp/tmpN3voYa/tmpHKBV6S': updated from 'https://[2001:67c:1254:44:b176::bade]:53863/uzp2r6j8xk5zy9rqn14ne00wau6n0m81'
3927243652471400647 was (originally) automatically approved
6821243068954340482 was (originally) automatically approved
Certificate '/tmp/tmp5x6v72/tmp_QVCrn': 'https://[2001:67c:1254:44:b176::bade]:49719/pe7i3ieeio61brrxrp5beabd74ztyaijMISSING' not downloaded, HTTP code 404
7434383937832019888 was (originally) automatically approved
7387619692973406094 was (originally) automatically approved
4717248790747310498 was (originally) automatically approved
5665100737594819087 was (originally) automatically approved
6276649584957526177 was (originally) automatically approved
8006880362687578155 was (originally) automatically approved
29956384451628888 was (originally) automatically approved
2918301996897732715 was (originally) automatically approved
u'https://[2001:67c:1254:44:b176::bade]:43095/l9skw3zz6l1c2onv5mso1y7zgo2tfxq2' not downloaded, problem ('Connection aborted.', error(104, 'Connection reset by peer'))
1310444426438176840 was (originally) automatically approved
8727766543237844080 was (originally) automatically approved
5917604106340641922 was (originally) automatically approved
9063471668037370031 was (originally) automatically approved
582548217438519965 was (originally) automatically approved
8970109290847944658 was (originally) automatically approved
7330074866413169774 was (originally) automatically approved
6886960775786245346 was (originally) automatically approved
8534170534511137087 was (originally) automatically approved
4844092899076305074 was (originally) automatically approved
6172372603182379487 was (originally) automatically approved
6425233404544543390 was (originally) automatically approved
6165084467836142176 was (originally) automatically approved
8469688823215898530 was (originally) automatically approved
8941286650478511707 was (originally) automatically approved
6480420202758990505 was (originally) automatically approved
2000183897979115446 was (originally) automatically approved
6085637565515639395 was (originally) automatically approved
3003741742293093995 was (originally) automatically approved
9018161531992779097 was (originally) automatically approved
909969952789311738 was (originally) automatically approved
6322745737670972162 was (originally) automatically approved
3920093949190681538 was (originally) automatically approved
5884232835007252566 was (originally) automatically approved
1925540735884114773 was (originally) automatically approved
7750934660091324500 was (originally) automatically approved
Certificate '/tmp/tmpC0VGYE/tmpqZnO6G': problem with 'https://[2001:67c:1254:44:b176::bade]:35717/h3ztz8riz0x6j1yhwbsbdrvtocaf5hm1' not downloaded: HTTPSConnectionPool(host='2001:67c:1254:44:b176::bade', port=35717): Max retries exceeded with url: /h3ztz8riz0x6j1yhwbsbdrvtocaf5hm1 (Caused by SSLError(SSLError(1, u'[SSL: TLSV1_ALERT_UNKNOWN_CA] tlsv1 alert unknown ca (_ssl.c:1946)'),))
7929324519758362237 was (originally) automatically approved
3146095607553925426 was (originally) automatically approved
4628796115478968587 was (originally) automatically approved
7934773189230304333 was (originally) automatically approved
5540595126740837588 was (originally) automatically approved
7508519390541680400 was (originally) automatically approved
6920897374994735360 was (originally) automatically approved
7083714350705077998 was (originally) automatically approved
6299984079642300854 was (originally) automatically approved
4700640965631059118 was (originally) automatically approved
7151132064667210847 was (originally) automatically approved
7280054368796756444 was (originally) automatically approved
3493718496217216617 was (originally) automatically approved
5898880691055233345 was (originally) automatically approved
7413141600353706089 was (originally) automatically approved
7898108899380420658 was (originally) automatically approved
4327486235238455983 was (originally) automatically approved
7076848678193278182 was (originally) automatically approved
4887409747547017561 was (originally) automatically approved
2199295274625868441 was (originally) automatically approved
8938223732004573151 was (originally) automatically approved
3605995677275206936 was (originally) automatically approved
4594703532918990453 was (originally) automatically approved
1464933218422598083 was (originally) automatically approved
5909543624374616650 was (originally) automatically approved
5670713699793697096 was (originally) automatically approved
1101002635948732755 was (originally) automatically approved
615528416037010501 was (originally) automatically approved
Sleeping for 1s
Couldn't lock '/tmp/tmpljo7kc/tmp9KobGl.lock'
...exiting.
Line 'buzz' is incorrect
Prepare: Used '/tmp/tmp_jdPop/tmp53j9Yr' for '/tmp/tmp_jdPop/tmpY8mRxD'
Prepare: Used '/tmp/tmpRC2wA1/tmpq7zdvf' for '/tmp/tmpRC2wA1/tmpPj6yiO'
Prepare: Used '/tmp/tmpdwv0el/tmpi7nmCP' for '/tmp/tmpdwv0el/tmpuq433u'
Certificate '/tmp/tmpDHkMhW/tmpQIRWvy': updated from 'http://example.com'
Certificate '/tmp/tmpMmvAc2/tmpzY2IaA': updated from 'http://example.com'
Certificate '/tmp/tmpDLJ_ae/tmpZ4GE4n': updated from 'http://example.com'
Certificate '/tmp/tmpRSZf4R/tmpPeIsCa': updated from 'http://example.com'
Certificate '/tmp/tmpuXCYAT/tmp8zRODY': updated from 'http://example.com'
Certificate '/tmp/tmpeihE46/tmpYNO03k': updated from 'http://example.com'
Certificate '/tmp/tmpnnDdVX/tmpEz38_p': updated from 'http://example.com'
Certificate '/tmp/tmpvJ5pw9/tmpJVaA23': updated from 'http://example.com'
Certificate '/tmp/tmpNTkrn4/tmpatRU8R': updated from 'http://example.com'
Certificate '/tmp/tmpLBuCWD/tmpUQI8QM': updated from 'http://example.com'
Certificate '/tmp/tmpJDLt2q/tmpXYtbPb': updated from 'http://example.com'
Certificate '/tmp/tmpfI0pEV/tmpl8f5tX': updated from '/master/certificate/file'
Certificate '/tmp/tmpFdn24D/tmpL2yHQ2': updated from 'http://example.com'
WARNING: Testing via this command is deprecated and will be removed in a future version. Users looking for a generic test entry point independent of test runner are encouraged to use tox.
test_GET_cleanCertificate (kedifa.test.KedifaIntegrationTest) ... Listening on [2001:67c:1254:44:b176::bade]:35103-35104
ok
test_GET_existing (kedifa.test.KedifaIntegrationTest) ... Listening on [2001:67c:1254:44:b176::bade]:47031-47032
ok
test_GET_existing_exact (kedifa.test.KedifaIntegrationTest) ... Listening on [2001:67c:1254:44:b176::bade]:42317-42318
ok
test_GET_existing_getter (kedifa.test.KedifaIntegrationTest) ... Listening on [2001:67c:1254:44:b176::bade]:43603-43604
ok
test_GET_existing_getter_name_does_not_match (kedifa.test.KedifaIntegrationTest) ... Listening on [2001:67c:1254:44:b176::bade]:43455-43456
ok
test_GET_existing_no_identity (kedifa.test.KedifaIntegrationTest) ... Listening on [2001:67c:1254:44:b176::bade]:36141-36142
ok
test_GET_existing_updater (kedifa.test.KedifaIntegrationTest) ... Listening on [2001:67c:1254:44:b176::bade]:59421-59422
ok
test_GET_existing_updater_name_does_not_match (kedifa.test.KedifaIntegrationTest) ... Listening on [2001:67c:1254:44:b176::bade]:50463-50464
ok
test_GET_expired (kedifa.test.KedifaIntegrationTest) ... Listening on [2001:67c:1254:44:b176::bade]:46901-46902
ok
test_GET_expired_identity (kedifa.test.KedifaIntegrationTest) ... skipped 'Hard to implement, and already being partially covered by test_GET_revoked_identity'
test_GET_generateauth (kedifa.test.KedifaIntegrationTest) ... Listening on [2001:67c:1254:44:b176::bade]:42779-42780
ok
test_GET_generateauth_no_reserved (kedifa.test.KedifaIntegrationTest) ... Listening on [2001:67c:1254:44:b176::bade]:37345-37346
ok
test_GET_getter_unsigned_identity (kedifa.test.KedifaIntegrationTest) ... Listening on [2001:67c:1254:44:b176::bade]:39065-39066
ok
test_GET_invalid_yet (kedifa.test.KedifaIntegrationTest) ... Listening on [2001:67c:1254:44:b176::bade]:54867-54868
ok
test_GET_list (kedifa.test.KedifaIntegrationTest) ... Listening on [2001:67c:1254:44:b176::bade]:40761-40762
ok
test_GET_list_cleanCertificate (kedifa.test.KedifaIntegrationTest) ... Listening on [2001:67c:1254:44:b176::bade]:52101-52102
ok
test_GET_list_empty (kedifa.test.KedifaIntegrationTest) ... Listening on [2001:67c:1254:44:b176::bade]:38021-38022
ok
test_GET_list_no_identity (kedifa.test.KedifaIntegrationTest) ... Listening on [2001:67c:1254:44:b176::bade]:49029-49030
ok
test_GET_new_server_ca (kedifa.test.KedifaIntegrationTest) ... Listening on [2001:67c:1254:44:b176::bade]:40833-40834
Listening on [2001:67c:1254:44:b176::bade]:58997-58998
ok
test_GET_not_existing (kedifa.test.KedifaIntegrationTest) ... Listening on [2001:67c:1254:44:b176::bade]:59927-59928
ERROR
test_GET_order (kedifa.test.KedifaIntegrationTest) ... Listening on [2001:67c:1254:44:b176::bade]:46793-46794
ok
test_GET_revoked_identity (kedifa.test.KedifaIntegrationTest) ... Listening on [2001:67c:1254:44:b176::bade]:42693-42694
ok
test_GET_root (kedifa.test.KedifaIntegrationTest) ... Listening on [2001:67c:1254:44:b176::bade]:58801-58802
ok
test_GET_unsigned_identity (kedifa.test.KedifaIntegrationTest) ... Listening on [2001:67c:1254:44:b176::bade]:40559-40560
ok
test_GET_updater_unsigned_identity (kedifa.test.KedifaIntegrationTest) ... Listening on [2001:67c:1254:44:b176::bade]:42395-42396
ok
test_PUT (kedifa.test.KedifaIntegrationTest) ... Listening on [2001:67c:1254:44:b176::bade]:46145-46146
ok
test_PUT_bad (kedifa.test.KedifaIntegrationTest) ... Listening on [2001:67c:1254:44:b176::bade]:33595-33596
ok
test_PUT_bad_auth (kedifa.test.KedifaIntegrationTest) ... Listening on [2001:67c:1254:44:b176::bade]:57825-57826
ok
test_PUT_certificate_expired (kedifa.test.KedifaIntegrationTest) ... Listening on [2001:67c:1254:44:b176::bade]:58927-58928
ok
test_PUT_certificate_key_mismatch (kedifa.test.KedifaIntegrationTest) ... Listening on [2001:67c:1254:44:b176::bade]:56919-56920
ok
test_PUT_certificate_not_valid_yet (kedifa.test.KedifaIntegrationTest) ... Listening on [2001:67c:1254:44:b176::bade]:57823-57824
ok
test_PUT_certificate_only (kedifa.test.KedifaIntegrationTest) ... Listening on [2001:67c:1254:44:b176::bade]:53715-53716
ok
test_PUT_key_before_certificate (kedifa.test.KedifaIntegrationTest) ... Listening on [2001:67c:1254:44:b176::bade]:43333-43334
ok
test_PUT_key_only (kedifa.test.KedifaIntegrationTest) ... Listening on [2001:67c:1254:44:b176::bade]:42035-42036
ok
test_PUT_multiple_different_reference (kedifa.test.KedifaIntegrationTest) ... Listening on [2001:67c:1254:44:b176::bade]:37389-37390
ok
test_PUT_multiple_same_reference (kedifa.test.KedifaIntegrationTest) ... Listening on [2001:67c:1254:44:b176::bade]:33959-33960
ok
test_PUT_no_auth (kedifa.test.KedifaIntegrationTest) ... Listening on [2001:67c:1254:44:b176::bade]:49615-49616
ok
test_bad_query_string (kedifa.test.KedifaIntegrationTest) ... Listening on [2001:67c:1254:44:b176::bade]:35763-35764
ok
test_reload_log (kedifa.test.KedifaIntegrationTest) ... Listening on [2001:67c:1254:44:b176::bade]:56581-56582
ok
test (kedifa.test.KedifaUpdaterLoopTest) ... ok
test_infinite (kedifa.test.KedifaUpdaterLoopTest) ... ok
test_lock (kedifa.test.KedifaUpdaterLoopTest) ... ok
test_raises (kedifa.test.KedifaUpdaterLoopTest) ... ok
test_updateMapping_empty (kedifa.test.KedifaUpdaterMappingTest) ... ok
test_updateMapping_morewhite (kedifa.test.KedifaUpdaterMappingTest) ... ok
test_updateMapping_normal (kedifa.test.KedifaUpdaterMappingTest) ... ok
test_updateMapping_one_comment (kedifa.test.KedifaUpdaterMappingTest) ... ok
test_updateMapping_one_empty (kedifa.test.KedifaUpdaterMappingTest) ... ok
test_updateMapping_one_not_enough (kedifa.test.KedifaUpdaterMappingTest) ... ok
test_updateMapping_with_fallback (kedifa.test.KedifaUpdaterMappingTest) ... ok
test_cert_master_fallback (kedifa.test.KedifaUpdaterUpdateCertificatePrepareTest) ... ok
test_cert_master_nofallback (kedifa.test.KedifaUpdaterUpdateCertificatePrepareTest) ... ok
test_cert_nomaster_fallback (kedifa.test.KedifaUpdaterUpdateCertificatePrepareTest) ... ok
test_cert_nomaster_nofallback (kedifa.test.KedifaUpdaterUpdateCertificatePrepareTest) ... ok
test_nocert_master_fallback (kedifa.test.KedifaUpdaterUpdateCertificatePrepareTest) ... ok
test_nocert_master_nofallback (kedifa.test.KedifaUpdaterUpdateCertificatePrepareTest) ... ok
test_nocert_nomaster_fallback (kedifa.test.KedifaUpdaterUpdateCertificatePrepareTest) ... ok
test_nocert_nomaster_nofallback (kedifa.test.KedifaUpdaterUpdateCertificatePrepareTest) ... ok
test_cert_fetch_master_fallback (kedifa.test.KedifaUpdaterUpdateCertificateTest) ... ok
test_cert_fetch_master_nofallback (kedifa.test.KedifaUpdaterUpdateCertificateTest) ... ok
test_cert_fetch_nomaster_fallback (kedifa.test.KedifaUpdaterUpdateCertificateTest) ... ok
test_cert_fetch_nomaster_nofallback (kedifa.test.KedifaUpdaterUpdateCertificateTest) ... ok
test_cert_nofetch_master_fallback (kedifa.test.KedifaUpdaterUpdateCertificateTest) ... ok
test_cert_nofetch_master_fallback_overridden (kedifa.test.KedifaUpdaterUpdateCertificateTest) ... ok
test_cert_nofetch_master_nofallback (kedifa.test.KedifaUpdaterUpdateCertificateTest) ... ok
test_cert_nofetch_nomaster_fallback (kedifa.test.KedifaUpdaterUpdateCertificateTest) ... ok
test_cert_nofetch_nomaster_fallback_overridden (kedifa.test.KedifaUpdaterUpdateCertificateTest) ... ok
test_cert_nofetch_nomaster_nofallback (kedifa.test.KedifaUpdaterUpdateCertificateTest) ... ok
test_nocert_fetch_master_fallback (kedifa.test.KedifaUpdaterUpdateCertificateTest) ... ok
test_nocert_fetch_master_nofallback (kedifa.test.KedifaUpdaterUpdateCertificateTest) ... ok
test_nocert_fetch_nomaster_fallback (kedifa.test.KedifaUpdaterUpdateCertificateTest) ... ok
test_nocert_fetch_nomaster_nofallback (kedifa.test.KedifaUpdaterUpdateCertificateTest) ... ok
test_nocert_nofetch_master_fallback (kedifa.test.KedifaUpdaterUpdateCertificateTest) ... ok
test_nocert_nofetch_master_nofallback (kedifa.test.KedifaUpdaterUpdateCertificateTest) ... ok
test_nocert_nofetch_nomaster_fallback (kedifa.test.KedifaUpdaterUpdateCertificateTest) ... ok
test_nocert_nofetch_nomaster_nofallback (kedifa.test.KedifaUpdaterUpdateCertificateTest) ... ok

======================================================================
ERROR: test_GET_not_existing (kedifa.test.KedifaIntegrationTest)
----------------------------------------------------------------------
Traceback (most recent call last):
File "/srv/slapgrid/slappart9/srv/testnode/bvi/inst/test0-0/parts/kedifa/kedifa/test.py", line 294, in setUp
self.setUpKedifa(self.kedifa_ip)
File "/srv/slapgrid/slappart9/srv/testnode/bvi/inst/test0-0/parts/kedifa/kedifa/test.py", line 253, in setUpKedifa
'Kedifa not available after %.2fs seconds' % (time.time() - b))
AssertionError: Kedifa not available after 5.13s seconds

----------------------------------------------------------------------
Ran 76 tests in 174.322s

FAILED (errors=1, skipped=1)
Test failed: <unittest.runner.TextTestResult run=76 errors=1 failures=0>
error: Test failed: <unittest.runner.TextTestResult run=76 errors=1 failures=0>