VIFIB DESCENTRALIZED CLOUD COMPUTING

SlapOS is a decentralized Cloud Computing technology that can automate the deployment and configuration of applications in a heterogeneous environment.
kedifa
184.484
76
0
8
1
FAILED
Completed
SLAPOS_TEST_LOG_DIRECTORY=/srv/slapgrid/slappart5/var/log/testnode/bvi-yjjGXylwOf SLAPOS_TEST_SHARED_PART_LIST=/srv/slapgrid/slappart5/srv/shared:/srv/slapgrid/slappart5/srv/testnode/bvi/shared /srv/slapgrid/slappart5/srv/testnode/bvi/soft/e1351768082399478c1b8d9a0c412905/bin/python_for_test setup.py test
Warning: build in /srv/slapgrid/slappart5/srv/testnode/bvi/soft/e1351768082399478c1b8d9a0c412905/parts/kedifa-repository is using versioneer.py from /srv/slapgrid/slappart5/srv/testnode/bvi/inst/test0-0/parts/kedifa/versioneer.py
running test
running egg_info
creating kedifa.egg-info
writing requirements to kedifa.egg-info/requires.txt
writing kedifa.egg-info/PKG-INFO
writing top-level names to kedifa.egg-info/top_level.txt
writing dependency_links to kedifa.egg-info/dependency_links.txt
writing entry points to kedifa.egg-info/entry_points.txt
writing manifest file 'kedifa.egg-info/SOURCES.txt'
reading manifest file 'kedifa.egg-info/SOURCES.txt'
reading manifest template 'MANIFEST.in'
writing manifest file 'kedifa.egg-info/SOURCES.txt'
running build_ext
8252422197824421712 was (originally) automatically approved
1196999564400782663 was (originally) automatically approved
4156452576642784391 was (originally) automatically approved
5349427438796066170 was (originally) automatically approved
1157832274647368026 was (originally) automatically approved
6391090674727398334 was (originally) automatically approved
281568404181197210 was (originally) automatically approved
3964945814214357733 was (originally) automatically approved
u'https://[2001:67c:1254:56:45a8::1471]:46277/pqy8gpvrp4jy1mq7gpxhkb3x3kn0j6q9MISSING' not downloaded, HTTP code 404
1845051100090988665 was (originally) automatically approved
8146706400281244786 was (originally) automatically approved
3108903573364871149 was (originally) automatically approved
2462700458484700959 was (originally) automatically approved
Certificate '/tmp/tmpMTjCnr/tmphNEaNM': updated from 'https://[2001:67c:1254:56:45a8::1471]:37799/u4n2zd2ewxvjupjl3z8qsb30wc2y9foq'
178030898992568821 was (originally) automatically approved
5441023390404337964 was (originally) automatically approved
Certificate '/tmp/tmp1xgb9o/tmpolTGsh': 'https://[2001:67c:1254:56:45a8::1471]:58463/3e050rcooc6nixpl9ic0ecx39piqmy9cMISSING' not downloaded, HTTP code 404
4087742071572147420 was (originally) automatically approved
226096173068524405 was (originally) automatically approved
5800422794117895880 was (originally) automatically approved
2287448415073366266 was (originally) automatically approved
6393081949397542513 was (originally) automatically approved
8887577862547534887 was (originally) automatically approved
3393498903400035745 was (originally) automatically approved
4751521129740425508 was (originally) automatically approved
81160864113439181 was (originally) automatically approved
5737249645956496903 was (originally) automatically approved
5927584767953049818 was (originally) automatically approved
5838102822627731752 was (originally) automatically approved
4142445239013818399 was (originally) automatically approved
8268594350160068500 was (originally) automatically approved
3760436261881550247 was (originally) automatically approved
7014301175627853290 was (originally) automatically approved
4866449881017085142 was (originally) automatically approved
7425168228564428831 was (originally) automatically approved
918336600980301090 was (originally) automatically approved
300461279239333851 was (originally) automatically approved
8849955959453309880 was (originally) automatically approved
5748264204496886038 was (originally) automatically approved
9217653688967679990 was (originally) automatically approved
5878098276429059150 was (originally) automatically approved
1164616200772445442 was (originally) automatically approved
3301578578452854613 was (originally) automatically approved
4491559490745406432 was (originally) automatically approved
6970315465165829567 was (originally) automatically approved
3332572294643871541 was (originally) automatically approved
2951517492977278205 was (originally) automatically approved
3226865243985423968 was (originally) automatically approved
1800563265284747529 was (originally) automatically approved
1223244860776560626 was (originally) automatically approved
5606366839794252436 was (originally) automatically approved
1110210611479311463 was (originally) automatically approved
6694550147017441660 was (originally) automatically approved
4566538910251083922 was (originally) automatically approved
6060204846488716246 was (originally) automatically approved
1184295729307891124 was (originally) automatically approved
2349161006072498740 was (originally) automatically approved
3461778759613407562 was (originally) automatically approved
1730874226378723257 was (originally) automatically approved
6522932216259309017 was (originally) automatically approved
2692972537194566968 was (originally) automatically approved
4629365005108368598 was (originally) automatically approved
2882936603444135718 was (originally) automatically approved
4187807333041148189 was (originally) automatically approved
4008177490298222123 was (originally) automatically approved
Sleeping for 1s
Couldn't lock '/tmp/tmpxEQrLg/tmp5cSJNf.lock'
...exiting.
Line 'buzz' is incorrect
Prepare: Used '/tmp/tmpeTTIZp/tmpC40xcJ' for '/tmp/tmpeTTIZp/tmp6cKxwU'
Prepare: Used '/tmp/tmpq5BlFw/tmpvq0qB1' for '/tmp/tmpq5BlFw/tmp4khAp_'
Prepare: Used '/tmp/tmpOIyNfu/tmpnIAIki' for '/tmp/tmpOIyNfu/tmp4s1C6y'
Certificate '/tmp/tmp6f3cFd/tmpDAwrkY': updated from 'http://example.com'
Certificate '/tmp/tmp8IubnA/tmpHMqThc': updated from 'http://example.com'
Certificate '/tmp/tmp0PeXb6/tmpsI1NKQ': updated from 'http://example.com'
Certificate '/tmp/tmpSzIMDj/tmphD_d33': updated from 'http://example.com'
Certificate '/tmp/tmpJf9IyH/tmprD5frD': updated from 'http://example.com'
Certificate '/tmp/tmpgPJEMU/tmpfYzAx9': updated from 'http://example.com'
Certificate '/tmp/tmpVwuhM1/tmpNee9sC': updated from 'http://example.com'
Certificate '/tmp/tmpl7KaKn/tmph0AOBC': updated from 'http://example.com'
Certificate '/tmp/tmpZgFB0R/tmp0yAwZU': updated from 'http://example.com'
Certificate '/tmp/tmpu9MPvu/tmpRzrkry': updated from 'http://example.com'
Certificate '/tmp/tmpChRcxX/tmpVOu7Pj': updated from 'http://example.com'
Certificate '/tmp/tmpvIvRTH/tmpmTM4Ke': updated from '/master/certificate/file'
Certificate '/tmp/tmpF1w8rW/tmp6Sx1QD': updated from 'http://example.com'
WARNING: Testing via this command is deprecated and will be removed in a future version. Users looking for a generic test entry point independent of test runner are encouraged to use tox.
test_GET_cleanCertificate (kedifa.test.KedifaIntegrationTest) ... ERROR
test_GET_existing (kedifa.test.KedifaIntegrationTest) ... Listening on [2001:67c:1254:56:45a8::1471]:32793-32794
ok
test_GET_existing_exact (kedifa.test.KedifaIntegrationTest) ... Listening on [2001:67c:1254:56:45a8::1471]:38009-38010
ok
test_GET_existing_getter (kedifa.test.KedifaIntegrationTest) ... Listening on [2001:67c:1254:56:45a8::1471]:54811-54812
ok
test_GET_existing_getter_name_does_not_match (kedifa.test.KedifaIntegrationTest) ... Listening on [2001:67c:1254:56:45a8::1471]:32865-32866
ok
test_GET_existing_no_identity (kedifa.test.KedifaIntegrationTest) ... Listening on [2001:67c:1254:56:45a8::1471]:59057-59058
ok
test_GET_existing_updater (kedifa.test.KedifaIntegrationTest) ... Listening on [2001:67c:1254:56:45a8::1471]:41795-41796
ok
test_GET_existing_updater_name_does_not_match (kedifa.test.KedifaIntegrationTest) ... Listening on [2001:67c:1254:56:45a8::1471]:48169-48170
ok
test_GET_expired (kedifa.test.KedifaIntegrationTest) ... Listening on [2001:67c:1254:56:45a8::1471]:42131-42132
ok
test_GET_expired_identity (kedifa.test.KedifaIntegrationTest) ... skipped 'Hard to implement, and already being partially covered by test_GET_revoked_identity'
test_GET_generateauth (kedifa.test.KedifaIntegrationTest) ... Listening on [2001:67c:1254:56:45a8::1471]:59045-59046
ok
test_GET_generateauth_no_reserved (kedifa.test.KedifaIntegrationTest) ... Listening on [2001:67c:1254:56:45a8::1471]:53105-53106
ok
test_GET_getter_unsigned_identity (kedifa.test.KedifaIntegrationTest) ... Listening on [2001:67c:1254:56:45a8::1471]:56485-56486
ERROR
test_GET_invalid_yet (kedifa.test.KedifaIntegrationTest) ... Listening on [2001:67c:1254:56:45a8::1471]:48813-48814
ok
test_GET_list (kedifa.test.KedifaIntegrationTest) ... Listening on [2001:67c:1254:56:45a8::1471]:34039-34040
ok
test_GET_list_cleanCertificate (kedifa.test.KedifaIntegrationTest) ... Listening on [2001:67c:1254:56:45a8::1471]:58765-58766
ok
test_GET_list_empty (kedifa.test.KedifaIntegrationTest) ... ERROR
test_GET_list_no_identity (kedifa.test.KedifaIntegrationTest) ... Listening on [2001:67c:1254:56:45a8::1471]:35261-35262
ok
test_GET_new_server_ca (kedifa.test.KedifaIntegrationTest) ... Listening on [2001:67c:1254:56:45a8::1471]:40979-40980
Listening on [2001:67c:1254:56:45a8::1471]:54749-54750
ok
test_GET_not_existing (kedifa.test.KedifaIntegrationTest) ... ERROR
test_GET_order (kedifa.test.KedifaIntegrationTest) ... ERROR
test_GET_revoked_identity (kedifa.test.KedifaIntegrationTest) ... ERROR
test_GET_root (kedifa.test.KedifaIntegrationTest) ... Listening on [2001:67c:1254:56:45a8::1471]:59889-59890
ERROR
test_GET_unsigned_identity (kedifa.test.KedifaIntegrationTest) ... Listening on [2001:67c:1254:56:45a8::1471]:52623-52624
ok
test_GET_updater_unsigned_identity (kedifa.test.KedifaIntegrationTest) ... Listening on [2001:67c:1254:56:45a8::1471]:51715-51716
ERROR
test_PUT (kedifa.test.KedifaIntegrationTest) ... Listening on [2001:67c:1254:56:45a8::1471]:59335-59336
ok
test_PUT_bad (kedifa.test.KedifaIntegrationTest) ... Listening on [2001:67c:1254:56:45a8::1471]:53909-53910
ok
test_PUT_bad_auth (kedifa.test.KedifaIntegrationTest) ... Listening on [2001:67c:1254:56:45a8::1471]:52035-52036
ok
test_PUT_certificate_expired (kedifa.test.KedifaIntegrationTest) ... Listening on [2001:67c:1254:56:45a8::1471]:41159-41160
ok
test_PUT_certificate_key_mismatch (kedifa.test.KedifaIntegrationTest) ... Listening on [2001:67c:1254:56:45a8::1471]:57607-57608
ok
test_PUT_certificate_not_valid_yet (kedifa.test.KedifaIntegrationTest) ... Listening on [2001:67c:1254:56:45a8::1471]:52263-52264
ok
test_PUT_certificate_only (kedifa.test.KedifaIntegrationTest) ... Listening on [2001:67c:1254:56:45a8::1471]:53239-53240
ok
test_PUT_key_before_certificate (kedifa.test.KedifaIntegrationTest) ... Listening on [2001:67c:1254:56:45a8::1471]:35225-35226
ok
test_PUT_key_only (kedifa.test.KedifaIntegrationTest) ... Listening on [2001:67c:1254:56:45a8::1471]:33619-33620
ok
test_PUT_multiple_different_reference (kedifa.test.KedifaIntegrationTest) ... Listening on [2001:67c:1254:56:45a8::1471]:44317-44318
ok
test_PUT_multiple_same_reference (kedifa.test.KedifaIntegrationTest) ... Listening on [2001:67c:1254:56:45a8::1471]:39475-39476
ok
test_PUT_no_auth (kedifa.test.KedifaIntegrationTest) ... Listening on [2001:67c:1254:56:45a8::1471]:44401-44402
ok
test_bad_query_string (kedifa.test.KedifaIntegrationTest) ... Listening on [2001:67c:1254:56:45a8::1471]:36421-36422
ok
test_reload_log (kedifa.test.KedifaIntegrationTest) ... Listening on [2001:67c:1254:56:45a8::1471]:37903-37904
ok
test (kedifa.test.KedifaUpdaterLoopTest) ... ok
test_infinite (kedifa.test.KedifaUpdaterLoopTest) ... ok
test_lock (kedifa.test.KedifaUpdaterLoopTest) ... ok
test_raises (kedifa.test.KedifaUpdaterLoopTest) ... ok
test_updateMapping_empty (kedifa.test.KedifaUpdaterMappingTest) ... ok
test_updateMapping_morewhite (kedifa.test.KedifaUpdaterMappingTest) ... ok
test_updateMapping_normal (kedifa.test.KedifaUpdaterMappingTest) ... ok
test_updateMapping_one_comment (kedifa.test.KedifaUpdaterMappingTest) ... ok
test_updateMapping_one_empty (kedifa.test.KedifaUpdaterMappingTest) ... ok
test_updateMapping_one_not_enough (kedifa.test.KedifaUpdaterMappingTest) ... ok
test_updateMapping_with_fallback (kedifa.test.KedifaUpdaterMappingTest) ... ok
test_cert_master_fallback (kedifa.test.KedifaUpdaterUpdateCertificatePrepareTest) ... ok
test_cert_master_nofallback (kedifa.test.KedifaUpdaterUpdateCertificatePrepareTest) ... ok
test_cert_nomaster_fallback (kedifa.test.KedifaUpdaterUpdateCertificatePrepareTest) ... ok
test_cert_nomaster_nofallback (kedifa.test.KedifaUpdaterUpdateCertificatePrepareTest) ... ok
test_nocert_master_fallback (kedifa.test.KedifaUpdaterUpdateCertificatePrepareTest) ... ok
test_nocert_master_nofallback (kedifa.test.KedifaUpdaterUpdateCertificatePrepareTest) ... ok
test_nocert_nomaster_fallback (kedifa.test.KedifaUpdaterUpdateCertificatePrepareTest) ... ok
test_nocert_nomaster_nofallback (kedifa.test.KedifaUpdaterUpdateCertificatePrepareTest) ... ok
test_cert_fetch_master_fallback (kedifa.test.KedifaUpdaterUpdateCertificateTest) ... ok
test_cert_fetch_master_nofallback (kedifa.test.KedifaUpdaterUpdateCertificateTest) ... ok
test_cert_fetch_nomaster_fallback (kedifa.test.KedifaUpdaterUpdateCertificateTest) ... ok
test_cert_fetch_nomaster_nofallback (kedifa.test.KedifaUpdaterUpdateCertificateTest) ... ok
test_cert_nofetch_master_fallback (kedifa.test.KedifaUpdaterUpdateCertificateTest) ... ok
test_cert_nofetch_master_fallback_overridden (kedifa.test.KedifaUpdaterUpdateCertificateTest) ... ok
test_cert_nofetch_master_nofallback (kedifa.test.KedifaUpdaterUpdateCertificateTest) ... ok
test_cert_nofetch_nomaster_fallback (kedifa.test.KedifaUpdaterUpdateCertificateTest) ... ok
test_cert_nofetch_nomaster_fallback_overridden (kedifa.test.KedifaUpdaterUpdateCertificateTest) ... ok
test_cert_nofetch_nomaster_nofallback (kedifa.test.KedifaUpdaterUpdateCertificateTest) ... ok
test_nocert_fetch_master_fallback (kedifa.test.KedifaUpdaterUpdateCertificateTest) ... ok
test_nocert_fetch_master_nofallback (kedifa.test.KedifaUpdaterUpdateCertificateTest) ... ok
test_nocert_fetch_nomaster_fallback (kedifa.test.KedifaUpdaterUpdateCertificateTest) ... ok
test_nocert_fetch_nomaster_nofallback (kedifa.test.KedifaUpdaterUpdateCertificateTest) ... ok
test_nocert_nofetch_master_fallback (kedifa.test.KedifaUpdaterUpdateCertificateTest) ... ok
test_nocert_nofetch_master_nofallback (kedifa.test.KedifaUpdaterUpdateCertificateTest) ... ok
test_nocert_nofetch_nomaster_fallback (kedifa.test.KedifaUpdaterUpdateCertificateTest) ... ok
test_nocert_nofetch_nomaster_nofallback (kedifa.test.KedifaUpdaterUpdateCertificateTest) ... ok

======================================================================
ERROR: test_GET_cleanCertificate (kedifa.test.KedifaIntegrationTest)
----------------------------------------------------------------------
Traceback (most recent call last):
File "/srv/slapgrid/slappart5/srv/testnode/bvi/inst/test0-0/parts/kedifa/kedifa/test.py", line 290, in setUp
self.setUpCaucase()
File "/srv/slapgrid/slappart5/srv/testnode/bvi/inst/test0-0/parts/kedifa/kedifa/test.py", line 172, in setUpCaucase
'Caucase not available after %.2fs seconds' % (time.time() - b))
AssertionError: Caucase not available after 5.16s seconds

======================================================================
ERROR: test_GET_getter_unsigned_identity (kedifa.test.KedifaIntegrationTest)
----------------------------------------------------------------------
Traceback (most recent call last):
File "/srv/slapgrid/slappart5/srv/testnode/bvi/inst/test0-0/parts/kedifa/kedifa/test.py", line 290, in setUp
self.setUpCaucase()
File "/srv/slapgrid/slappart5/srv/testnode/bvi/inst/test0-0/parts/kedifa/kedifa/test.py", line 172, in setUpCaucase
'Caucase not available after %.2fs seconds' % (time.time() - b))
AssertionError: Caucase not available after 5.15s seconds

======================================================================
ERROR: test_GET_list_empty (kedifa.test.KedifaIntegrationTest)
----------------------------------------------------------------------
Traceback (most recent call last):
File "/srv/slapgrid/slappart5/srv/testnode/bvi/inst/test0-0/parts/kedifa/kedifa/test.py", line 290, in setUp
self.setUpCaucase()
File "/srv/slapgrid/slappart5/srv/testnode/bvi/inst/test0-0/parts/kedifa/kedifa/test.py", line 172, in setUpCaucase
'Caucase not available after %.2fs seconds' % (time.time() - b))
AssertionError: Caucase not available after 5.13s seconds

======================================================================
ERROR: test_GET_not_existing (kedifa.test.KedifaIntegrationTest)
----------------------------------------------------------------------
Traceback (most recent call last):
File "/srv/slapgrid/slappart5/srv/testnode/bvi/inst/test0-0/parts/kedifa/kedifa/test.py", line 290, in setUp
self.setUpCaucase()
File "/srv/slapgrid/slappart5/srv/testnode/bvi/inst/test0-0/parts/kedifa/kedifa/test.py", line 172, in setUpCaucase
'Caucase not available after %.2fs seconds' % (time.time() - b))
AssertionError: Caucase not available after 5.12s seconds

======================================================================
ERROR: test_GET_order (kedifa.test.KedifaIntegrationTest)
----------------------------------------------------------------------
Traceback (most recent call last):
File "/srv/slapgrid/slappart5/srv/testnode/bvi/inst/test0-0/parts/kedifa/kedifa/test.py", line 290, in setUp
self.setUpCaucase()
File "/srv/slapgrid/slappart5/srv/testnode/bvi/inst/test0-0/parts/kedifa/kedifa/test.py", line 172, in setUpCaucase
'Caucase not available after %.2fs seconds' % (time.time() - b))
AssertionError: Caucase not available after 5.13s seconds

======================================================================
ERROR: test_GET_revoked_identity (kedifa.test.KedifaIntegrationTest)
----------------------------------------------------------------------
Traceback (most recent call last):
File "/srv/slapgrid/slappart5/srv/testnode/bvi/inst/test0-0/parts/kedifa/kedifa/test.py", line 290, in setUp
self.setUpCaucase()
File "/srv/slapgrid/slappart5/srv/testnode/bvi/inst/test0-0/parts/kedifa/kedifa/test.py", line 172, in setUpCaucase
'Caucase not available after %.2fs seconds' % (time.time() - b))
AssertionError: Caucase not available after 5.13s seconds

======================================================================
ERROR: test_GET_root (kedifa.test.KedifaIntegrationTest)
----------------------------------------------------------------------
Traceback (most recent call last):
File "/srv/slapgrid/slappart5/srv/testnode/bvi/inst/test0-0/parts/kedifa/kedifa/test.py", line 290, in setUp
self.setUpCaucase()
File "/srv/slapgrid/slappart5/srv/testnode/bvi/inst/test0-0/parts/kedifa/kedifa/test.py", line 172, in setUpCaucase
'Caucase not available after %.2fs seconds' % (time.time() - b))
AssertionError: Caucase not available after 5.14s seconds

======================================================================
ERROR: test_GET_updater_unsigned_identity (kedifa.test.KedifaIntegrationTest)
----------------------------------------------------------------------
Traceback (most recent call last):
File "/srv/slapgrid/slappart5/srv/testnode/bvi/inst/test0-0/parts/kedifa/kedifa/test.py", line 290, in setUp
self.setUpCaucase()
File "/srv/slapgrid/slappart5/srv/testnode/bvi/inst/test0-0/parts/kedifa/kedifa/test.py", line 172, in setUpCaucase
'Caucase not available after %.2fs seconds' % (time.time() - b))
AssertionError: Caucase not available after 5.14s seconds

----------------------------------------------------------------------
Ran 76 tests in 184.484s

FAILED (errors=8, skipped=1)
Test failed: <unittest.runner.TextTestResult run=76 errors=8 failures=0>
error: Test failed: <unittest.runner.TextTestResult run=76 errors=8 failures=0>