VIFIB DESCENTRALIZED CLOUD COMPUTING

SlapOS is a decentralized Cloud Computing technology that can automate the deployment and configuration of applications in a heterogeneous environment.
slapos.core
1 268.414
683
1
0
31
FAILED
Completed
SLAPOS_TEST_LOG_DIRECTORY=/srv/slapgrid/slappart7/var/log/testnode/cum-HOE8oHpmeA SLAPOS_TEST_SHARED_PART_LIST=/srv/slapgrid/slappart7/srv/shared:/srv/slapgrid/slappart7/srv/testnode/cum/shared /srv/slapgrid/slappart7/srv/testnode/cum/soft/634492edcf7e7215bee7810c097cc1dc/bin/python_for_test setup.py test
running test
running egg_info
creating slapos.core.egg-info
writing slapos.core.egg-info/PKG-INFO
writing dependency_links to slapos.core.egg-info/dependency_links.txt
writing entry points to slapos.core.egg-info/entry_points.txt
writing namespace_packages to slapos.core.egg-info/namespace_packages.txt
writing requirements to slapos.core.egg-info/requires.txt
writing top-level names to slapos.core.egg-info/top_level.txt
writing manifest file 'slapos.core.egg-info/SOURCES.txt'
reading manifest file 'slapos.core.egg-info/SOURCES.txt'
reading manifest template 'MANIFEST.in'
writing manifest file 'slapos.core.egg-info/SOURCES.txt'
running build_ext
['useradd']
['useradd']
['useradd', '-d', '/doesnotexistsyet', '-g', 'doesnotexistsyet', '-s', '/bin/sh', 'doesnotexistsyet', '-r']
['useradd', '-d', '/doesnotexistsyet', '-g', 'doesnotexistsyet', '-s', '/bin/sh', '-G', 'additionalgroup1,additionalgroup2', 'doesnotexistsyet', '-r']
['useradd', '-d', '/testuser', '-g', 'testuser', '-s', '/bin/sh', 'testuser', '-r']
[BOOT] Checking if 'interface_name_from_config' has IPv6...
[BOOT] Invoking slapos node format...
[BOOT] Invoking slapos node bang...
Removing /tmp/tmpdkfvq5mo/instance/partition1/.timestamp
WARNING: Testing via this command is deprecated and will be removed in a future version. Users looking for a generic test entry point independent of test runner are encouraged to use tox.
test_no_instance_root (slapos.tests.test_slapgrid.TestBasicSlapgridCP) ... ok
test_no_master (slapos.tests.test_slapgrid.TestBasicSlapgridCP) ... /srv/slapgrid/slappart7/srv/testnode/cum/inst/test0-0/parts/slapos.core/slapos/grid/slapgrid.py:537: ResourceWarning: unclosed file <_io.BufferedReader name=7>
launchSupervisord(instance_root=self.instance_root, logger=self.logger)
ResourceWarning: Enable tracemalloc to get the object allocation traceback
ok
test_no_software_root (slapos.tests.test_slapgrid.TestBasicSlapgridCP) ... ok
test_no_instance_root (slapos.tests.test_slapgrid.TestBasicSlapgridPromise) ... ok
test_no_master (slapos.tests.test_slapgrid.TestBasicSlapgridPromise) ... ok
test_no_software_root (slapos.tests.test_slapgrid.TestBasicSlapgridPromise) ... ok
test_no_errors (slapos.tests.test_slapgrid.TestRequiredOnlyPartitions) ... ok
test_one_missing (slapos.tests.test_slapgrid.TestRequiredOnlyPartitions) ... /srv/slapgrid/slappart7/srv/testnode/cum/inst/test0-0/parts/slapos.core/slapos/tests/test_slapgrid.py:260: DeprecationWarning: Please use assertRaisesRegex instead.
existing, required)
ok
test_several_missing (slapos.tests.test_slapgrid.TestRequiredOnlyPartitions) ... ok
test_launchSupervisord_fail (slapos.tests.test_slapgrid.TestSVCBackend)
Proper message is displayed when supervisor can not be started. ... /srv/slapgrid/slappart7/srv/testnode/cum/shared/python3/3c76e4d5caeddddc982d72375e043ecc/lib/python3.7/traceback.py:220: ResourceWarning: unclosed file <_io.BufferedReader name=7>
tb.tb_frame.clear()
ResourceWarning: Enable tracemalloc to get the object allocation traceback
ok
test_one_partition_buildout_fail_does_not_disturb_others (slapos.tests.test_slapgrid.TestSlapgridCPPartitionProcessing)
1. We set up two instance one using a corrupted buildout ... /srv/slapgrid/slappart7/srv/testnode/cum/inst/test0-0/parts/slapos.core/slapos/grid/SlapObject.py:674: ResourceWarning: unclosed file <_io.BufferedReader name=9>
debug=self.buildout_debug)
ResourceWarning: Enable tracemalloc to get the object allocation traceback
ok
test_one_partition_buildout_fail_is_correctly_logged (slapos.tests.test_slapgrid.TestSlapgridCPPartitionProcessing)
1. We set up an instance using a corrupted buildout ... /srv/slapgrid/slappart7/srv/testnode/cum/soft/634492edcf7e7215bee7810c097cc1dc/eggs/six-1.12.0-py3.7.egg/six.py:581: ResourceWarning: unclosed file <_io.FileIO name=8 mode='rb' closefd=True>
return iter(d.keys(**kw))
ResourceWarning: Enable tracemalloc to get the object allocation traceback
ok
test_one_partition_destroyed_is_not_processed_after_periodicity (slapos.tests.test_slapgrid.TestSlapgridCPPartitionProcessing)
Check that periodicity forces processing a partition even if it is not ... ok
test_one_partition_is_always_processed_when_periodicity_is_zero (slapos.tests.test_slapgrid.TestSlapgridCPPartitionProcessing)
Checks that a partition is always processed when ... ok
test_one_partition_is_never_processed_when_periodicity_is_negative (slapos.tests.test_slapgrid.TestSlapgridCPPartitionProcessing)
Checks that a partition is not processed when ... ok
test_one_partition_lacking_path_does_not_disturb_others (slapos.tests.test_slapgrid.TestSlapgridCPPartitionProcessing)
1. We set up two instances but remove path of one ... ok
test_one_partition_lacking_software_bin_path_does_not_disturb_others (slapos.tests.test_slapgrid.TestSlapgridCPPartitionProcessing)
1. We set up two instance but remove software bin path of one ... ok
test_one_partition_lacking_software_path_does_not_disturb_others (slapos.tests.test_slapgrid.TestSlapgridCPPartitionProcessing)
1. We set up two instance but remove software path of one ... ok
test_one_partition_periodicity_from_file_does_not_disturb_others (slapos.tests.test_slapgrid.TestSlapgridCPPartitionProcessing)
If time between last processing of instance and now is superior ... ok
test_one_partition_stopped_is_not_processed_after_periodicity (slapos.tests.test_slapgrid.TestSlapgridCPPartitionProcessing)
Check that periodicity forces processing a partition even if it is not ... ok
test_partition_old_timestamp (slapos.tests.test_slapgrid.TestSlapgridCPPartitionProcessing) ... ok
test_partition_periodicity_remove_timestamp (slapos.tests.test_slapgrid.TestSlapgridCPPartitionProcessing)
Check that if periodicity forces run of buildout for a partition, it ... /srv/slapgrid/slappart7/srv/testnode/cum/shared/python3/3c76e4d5caeddddc982d72375e043ecc/lib/python3.7/json/encoder.py:256: ResourceWarning: unclosed file <_io.BufferedReader name=8>
self.skipkeys, _one_shot)
ResourceWarning: Enable tracemalloc to get the object allocation traceback
ok
test_partition_timestamp (slapos.tests.test_slapgrid.TestSlapgridCPPartitionProcessing) ... /srv/slapgrid/slappart7/srv/testnode/cum/inst/test0-0/parts/slapos.core/slapos/grid/SlapObject.py:674: ResourceWarning: unclosed file <_io.BufferedReader name=8>
debug=self.buildout_debug)
ResourceWarning: Enable tracemalloc to get the object allocation traceback
ok
test_partition_timestamp_develop (slapos.tests.test_slapgrid.TestSlapgridCPPartitionProcessing) ... ok
test_partition_timestamp_new_timestamp (slapos.tests.test_slapgrid.TestSlapgridCPPartitionProcessing) ... ok
test_partition_timestamp_no_timestamp (slapos.tests.test_slapgrid.TestSlapgridCPPartitionProcessing) ... ok
test_processing_summary (slapos.tests.test_slapgrid.TestSlapgridCPPartitionProcessing)
At the end of instance processing, a summary of partition with errors is displayed. ... /srv/slapgrid/slappart7/srv/testnode/cum/inst/test0-0/parts/slapos.core/slapos/tests/test_slapgrid.py:1722: DeprecationWarning: Please use assertRegex instead.
r" 1\[\(not ready\)\]: Failed to run buildout profile in directory '.*/instance/1':\nfake buildout error\n\n")
ok
test_checkAddFirewallRules (slapos.tests.test_slapgrid.TestSlapgridCPWithFirewall) ... ok
test_getFirewallRules (slapos.tests.test_slapgrid.TestSlapgridCPWithFirewall) ... ok
test_partition_firewall (slapos.tests.test_slapgrid.TestSlapgridCPWithFirewall) ... /srv/slapgrid/slappart7/srv/testnode/cum/inst/test0-0/parts/slapos.core/slapos/grid/slapgrid.py:537: ResourceWarning: unclosed file <_io.BufferedReader name=10>
launchSupervisord(instance_root=self.instance_root, logger=self.logger)
ResourceWarning: Enable tracemalloc to get the object allocation traceback
/srv/slapgrid/slappart7/srv/testnode/cum/inst/test0-0/parts/slapos.core/slapos/grid/SlapObject.py:674: ResourceWarning: unclosed file <_io.BufferedReader name=11>
debug=self.buildout_debug)
ResourceWarning: Enable tracemalloc to get the object allocation traceback
ok
test_partition_firewall_ip_change (slapos.tests.test_slapgrid.TestSlapgridCPWithFirewall) ... ok
test_partition_firewall_ipsource_accept (slapos.tests.test_slapgrid.TestSlapgridCPWithFirewall) ... ok
test_partition_firewall_ipsource_reject (slapos.tests.test_slapgrid.TestSlapgridCPWithFirewall) ... ok
test_partition_firewall_restrict (slapos.tests.test_slapgrid.TestSlapgridCPWithFirewall) ... ok
test_partition_firewall_restricted_access_change (slapos.tests.test_slapgrid.TestSlapgridCPWithFirewall) ... skipped "Always fail: instance.filter_dict can't change"
test_partition_no_firewall (slapos.tests.test_slapgrid.TestSlapgridCPWithFirewall) ... ok
test_nothing_to_do (slapos.tests.test_slapgrid.TestSlapgridCPWithMaster) ... ok
test_one_broken_partition_stopped (slapos.tests.test_slapgrid.TestSlapgridCPWithMaster)
Check that, for, an already started instance if stop is requested, ... ok
test_one_free_partition (slapos.tests.test_slapgrid.TestSlapgridCPWithMaster)
Test if slapgrid cp does not process "free" partition ... ok
test_one_partition (slapos.tests.test_slapgrid.TestSlapgridCPWithMaster) ... /srv/slapgrid/slappart7/srv/testnode/cum/inst/test0-0/parts/slapos.core/slapos/grid/SlapObject.py:674: ResourceWarning: unclosed file <_io.BufferedReader name=12>
debug=self.buildout_debug)
ResourceWarning: Enable tracemalloc to get the object allocation traceback
ok
test_one_partition_destroyed (slapos.tests.test_slapgrid.TestSlapgridCPWithMaster)
Test that an existing partition with "destroyed" status will only be ... ok
test_one_partition_instance_cfg (slapos.tests.test_slapgrid.TestSlapgridCPWithMaster)
Check that slapgrid processes instance is profile is not named ... ok
test_one_partition_started (slapos.tests.test_slapgrid.TestSlapgridCPWithMaster) ... ok
test_one_partition_started_fail (slapos.tests.test_slapgrid.TestSlapgridCPWithMaster) ... ok
test_one_partition_started_stopped (slapos.tests.test_slapgrid.TestSlapgridCPWithMaster) ... /srv/slapgrid/slappart7/srv/testnode/cum/inst/test0-0/parts/slapos.core/slapos/grid/SlapObject.py:674: ResourceWarning: unclosed file <_io.BufferedReader name=13>
debug=self.buildout_debug)
ResourceWarning: Enable tracemalloc to get the object allocation traceback
/srv/slapgrid/slappart7/srv/testnode/cum/shared/python3/3c76e4d5caeddddc982d72375e043ecc/lib/python3.7/json/encoder.py:256: ResourceWarning: unclosed file <_io.FileIO name=12 mode='rb' closefd=True>
self.skipkeys, _one_shot)
ResourceWarning: Enable tracemalloc to get the object allocation traceback
ok
test_one_partition_stopped_started (slapos.tests.test_slapgrid.TestSlapgridCPWithMaster) ... ok
test_one_failing_promise (slapos.tests.test_slapgrid.TestSlapgridCPWithMasterPromise) ... ok
test_one_succeeding_one_failing_promises (slapos.tests.test_slapgrid.TestSlapgridCPWithMasterPromise) ... ok
test_one_succeeding_one_timing_out_promises (slapos.tests.test_slapgrid.TestSlapgridCPWithMasterPromise) ... /srv/slapgrid/slappart7/srv/testnode/cum/inst/test0-0/parts/slapos.core/slapos/grid/slapgrid.py:537: ResourceWarning: unclosed file <_io.BufferedReader name=13>
launchSupervisord(instance_root=self.instance_root, logger=self.logger)
ResourceWarning: Enable tracemalloc to get the object allocation traceback
/srv/slapgrid/slappart7/srv/testnode/cum/inst/test0-0/parts/slapos.core/slapos/grid/SlapObject.py:674: ResourceWarning: unclosed file <_io.BufferedReader name=14>
debug=self.buildout_debug)
ResourceWarning: Enable tracemalloc to get the object allocation traceback
ok
test_one_succeeding_promise (slapos.tests.test_slapgrid.TestSlapgridCPWithMasterPromise) ... /srv/slapgrid/slappart7/srv/testnode/cum/inst/test0-0/parts/slapos.core/slapos/grid/SlapObject.py:674: ResourceWarning: unclosed file <_io.BufferedReader name=15>
debug=self.buildout_debug)
ResourceWarning: Enable tracemalloc to get the object allocation traceback
ok
test_promise_notrun_if_partition_stopped_fail (slapos.tests.test_slapgrid.TestSlapgridCPWithMasterPromise) ... ok
test_promise_run_if_partition_started_fail (slapos.tests.test_slapgrid.TestSlapgridCPWithMasterPromise) ... /srv/slapgrid/slappart7/srv/testnode/cum/shared/python3/3c76e4d5caeddddc982d72375e043ecc/lib/python3.7/threading.py:227: ResourceWarning: unclosed file <_io.FileIO name=14 mode='rb' closefd=True>
self._release_save = lock._release_save
ResourceWarning: Enable tracemalloc to get the object allocation traceback
/srv/slapgrid/slappart7/srv/testnode/cum/shared/python3/3c76e4d5caeddddc982d72375e043ecc/lib/python3.7/threading.py:227: ResourceWarning: unclosed file <_io.FileIO name=15 mode='rb' closefd=True>
self._release_save = lock._release_save
ResourceWarning: Enable tracemalloc to get the object allocation traceback
ok
test_stderr_has_been_sent (slapos.tests.test_slapgrid.TestSlapgridCPWithMasterPromise) ... /srv/slapgrid/slappart7/srv/testnode/cum/inst/test0-0/parts/slapos.core/slapos/grid/SlapObject.py:674: ResourceWarning: unclosed file <_io.BufferedReader name=16>
debug=self.buildout_debug)
ResourceWarning: Enable tracemalloc to get the object allocation traceback
/srv/slapgrid/slappart7/srv/testnode/cum/shared/python3/3c76e4d5caeddddc982d72375e043ecc/lib/python3.7/importlib/_bootstrap_external.py:525: ResourceWarning: unclosed file <_io.FileIO name=14 mode='rb' closefd=True>
code = marshal.loads(data)
ResourceWarning: Enable tracemalloc to get the object allocation traceback
/srv/slapgrid/slappart7/srv/testnode/cum/shared/python3/3c76e4d5caeddddc982d72375e043ecc/lib/python3.7/importlib/_bootstrap_external.py:525: ResourceWarning: unclosed file <_io.FileIO name=15 mode='rb' closefd=True>
code = marshal.loads(data)
ResourceWarning: Enable tracemalloc to get the object allocation traceback
/srv/slapgrid/slappart7/srv/testnode/cum/shared/python3/3c76e4d5caeddddc982d72375e043ecc/lib/python3.7/json/encoder.py:402: ResourceWarning: unclosed file <_io.FileIO name=14 mode='rb' closefd=True>
chunks = _iterencode_dict(value, _current_indent_level)
ResourceWarning: Enable tracemalloc to get the object allocation traceback
/srv/slapgrid/slappart7/srv/testnode/cum/shared/python3/3c76e4d5caeddddc982d72375e043ecc/lib/python3.7/json/encoder.py:402: ResourceWarning: unclosed file <_io.FileIO name=15 mode='rb' closefd=True>
chunks = _iterencode_dict(value, _current_indent_level)
ResourceWarning: Enable tracemalloc to get the object allocation traceback
ok
test_timeout_works (slapos.tests.test_slapgrid.TestSlapgridCPWithMasterPromise) ... /srv/slapgrid/slappart7/srv/testnode/cum/inst/test0-0/parts/slapos.core/slapos/grid/slapgrid.py:537: ResourceWarning: unclosed file <_io.BufferedReader name=15>
launchSupervisord(instance_root=self.instance_root, logger=self.logger)
ResourceWarning: Enable tracemalloc to get the object allocation traceback
ok
test_two_succeeding_promises (slapos.tests.test_slapgrid.TestSlapgridCPWithMasterPromise) ... /srv/slapgrid/slappart7/srv/testnode/cum/inst/test0-0/parts/slapos.core/slapos/grid/slapgrid.py:537: ResourceWarning: unclosed file <_io.BufferedReader name=18>
launchSupervisord(instance_root=self.instance_root, logger=self.logger)
ResourceWarning: Enable tracemalloc to get the object allocation traceback
/srv/slapgrid/slappart7/srv/testnode/cum/inst/test0-0/parts/slapos.core/slapos/grid/SlapObject.py:674: ResourceWarning: unclosed file <_io.BufferedReader name=19>
debug=self.buildout_debug)
ResourceWarning: Enable tracemalloc to get the object allocation traceback
/srv/slapgrid/slappart7/srv/testnode/cum/shared/python3/3c76e4d5caeddddc982d72375e043ecc/lib/python3.7/importlib/_bootstrap_external.py:525: ResourceWarning: unclosed file <_io.BufferedReader name=8>
code = marshal.loads(data)
ResourceWarning: Enable tracemalloc to get the object allocation traceback
/srv/slapgrid/slappart7/srv/testnode/cum/shared/python3/3c76e4d5caeddddc982d72375e043ecc/lib/python3.7/importlib/_bootstrap_external.py:525: ResourceWarning: unclosed file <_io.BufferedReader name=11>
code = marshal.loads(data)
ResourceWarning: Enable tracemalloc to get the object allocation traceback
/srv/slapgrid/slappart7/srv/testnode/cum/shared/python3/3c76e4d5caeddddc982d72375e043ecc/lib/python3.7/importlib/_bootstrap_external.py:525: ResourceWarning: unclosed file <_io.BufferedReader name=8>
code = marshal.loads(data)
ResourceWarning: Enable tracemalloc to get the object allocation traceback
/srv/slapgrid/slappart7/srv/testnode/cum/shared/python3/3c76e4d5caeddddc982d72375e043ecc/lib/python3.7/importlib/_bootstrap_external.py:525: ResourceWarning: unclosed file <_io.BufferedReader name=11>
code = marshal.loads(data)
ResourceWarning: Enable tracemalloc to get the object allocation traceback
/srv/slapgrid/slappart7/srv/testnode/cum/shared/python3/3c76e4d5caeddddc982d72375e043ecc/lib/python3.7/json/encoder.py:256: ResourceWarning: unclosed file <_io.BufferedReader name=11>
self.skipkeys, _one_shot)
ResourceWarning: Enable tracemalloc to get the object allocation traceback
ok
test_not_watched_by_watchdog_do_not_bang (slapos.tests.test_slapgrid.TestSlapgridCPWithMasterWatchdog)
Test that a process going to fatal or exited mode in supervisord ... ok
test_one_failing_daemon_in_run_will_not_bang_with_watchdog (slapos.tests.test_slapgrid.TestSlapgridCPWithMasterWatchdog)
Check that a failing service watched by watchdog does not trigger bang ... ok
test_one_failing_daemon_in_service_will_bang_with_watchdog (slapos.tests.test_slapgrid.TestSlapgridCPWithMasterWatchdog)
Check that a failing service watched by watchdog trigger bang ... ok
test_unwanted_events_will_not_bang (slapos.tests.test_slapgrid.TestSlapgridCPWithMasterWatchdog)
Test that a process going to a mode not watched by watchdog ... ok
test_watchdog_bang_only_once_if_partition_never_deployed (slapos.tests.test_slapgrid.TestSlapgridCPWithMasterWatchdog)
For a partition that has been never successfully deployed (promises are not passing, ... ok
test_watchdog_bang_only_once_if_timestamp_did_not_change (slapos.tests.test_slapgrid.TestSlapgridCPWithMasterWatchdog)
For a partition that has been successfully deployed (promises are passing, ... ok
test_watchdog_create_bang_file_after_bang (slapos.tests.test_slapgrid.TestSlapgridCPWithMasterWatchdog)
For a partition that has been successfully deployed (thus .timestamp file ... ok
test_watchdog_ignore_bang_if_partition_not_deployed (slapos.tests.test_slapgrid.TestSlapgridCPWithMasterWatchdog)
For a partition that has never been successfully deployed (buildout is ... ok
test_watched_by_watchdog_bang (slapos.tests.test_slapgrid.TestSlapgridCPWithMasterWatchdog)
Test that a process going to fatal or exited mode in supervisord ... ok
test_one_partition (slapos.tests.test_slapgrid.TestSlapgridCPWithTransaction) ... ok
test_retention_lock (slapos.tests.test_slapgrid.TestSlapgridDestructionLock)
Higher level test about actual retention (or no-retention) of instance ... ok
test_partition_instance (slapos.tests.test_slapgrid.TestSlapgridManagerLifecycle) ... ok
test_partition_software (slapos.tests.test_slapgrid.TestSlapgridManagerLifecycle) ... /srv/slapgrid/slappart7/srv/testnode/cum/inst/test0-0/parts/slapos.core/slapos/grid/SlapObject.py:310: ResourceWarning: unclosed file <_io.BufferedReader name=8>
debug=self.buildout_debug)
ResourceWarning: Enable tracemalloc to get the object allocation traceback
ok
test_partition_software_fail (slapos.tests.test_slapgrid.TestSlapgridManagerLifecycle)
Manager.softwareTearDown should not run when software release fail. ... /srv/slapgrid/slappart7/srv/testnode/cum/inst/test0-0/parts/slapos.core/slapos/grid/slapgrid.py:626: ResourceWarning: unclosed file <_io.BufferedReader name=8>
self.logger.exception('Problem while reporting error, continuing:')
ResourceWarning: Enable tracemalloc to get the object allocation traceback
ok
test_no_fd_leak (slapos.tests.test_slapgrid.TestSlapgridNoFDLeak) ... /srv/slapgrid/slappart7/srv/testnode/cum/inst/test0-0/parts/slapos.core/slapos/grid/slapgrid.py:626: ResourceWarning: unclosed file <_io.BufferedReader name=12>
self.logger.exception('Problem while reporting error, continuing:')
ResourceWarning: Enable tracemalloc to get the object allocation traceback
ok
test_one_failing_plugin_promise (slapos.tests.test_slapgrid.TestSlapgridPromiseWithMaster) ... ok
test_one_failing_promise (slapos.tests.test_slapgrid.TestSlapgridPromiseWithMaster) ... ok
test_one_succeeding_one_failing_promises (slapos.tests.test_slapgrid.TestSlapgridPromiseWithMaster) ... ok
test_one_succeeding_one_failing_promises_plugin (slapos.tests.test_slapgrid.TestSlapgridPromiseWithMaster) ... ok
test_one_succeeding_one_timing_out_promises (slapos.tests.test_slapgrid.TestSlapgridPromiseWithMaster) ... ok
test_one_succeeding_plugin_promise (slapos.tests.test_slapgrid.TestSlapgridPromiseWithMaster) ... ok
test_one_succeeding_promise (slapos.tests.test_slapgrid.TestSlapgridPromiseWithMaster) ... ok
test_promise_notrun_if_partition_stopped (slapos.tests.test_slapgrid.TestSlapgridPromiseWithMaster) ... ok
test_promise_notrun_if_partition_stopped_plugin (slapos.tests.test_slapgrid.TestSlapgridPromiseWithMaster) ... ok
test_stderr_has_been_sent (slapos.tests.test_slapgrid.TestSlapgridPromiseWithMaster) ... ok
test_stderr_has_been_sent_plugin (slapos.tests.test_slapgrid.TestSlapgridPromiseWithMaster) ... ok
test_timeout_works (slapos.tests.test_slapgrid.TestSlapgridPromiseWithMaster) ... ok
test_timeout_works_plugin (slapos.tests.test_slapgrid.TestSlapgridPromiseWithMaster) ... ok
test_two_succeeding_plugin_promise (slapos.tests.test_slapgrid.TestSlapgridPromiseWithMaster) ... ok
test_two_succeeding_promises (slapos.tests.test_slapgrid.TestSlapgridPromiseWithMaster) ... ok
test_partition_destroy_pre_remove_script_not_stopped (slapos.tests.test_slapgrid.TestSlapgridReportWithPreDeleteScript) ... ok
test_partition_destroy_pre_remove_script_run_as_partition_user (slapos.tests.test_slapgrid.TestSlapgridReportWithPreDeleteScript) ... ok
test_partition_destroy_pre_remove_with_retention_lock (slapos.tests.test_slapgrid.TestSlapgridReportWithPreDeleteScript) ... ok
test_partition_destroy_with_pre_remove_service (slapos.tests.test_slapgrid.TestSlapgridReportWithPreDeleteScript) ... ok
test_one_software_buildout_fail_is_correctly_logged (slapos.tests.test_slapgrid.TestSlapgridSoftwareRelease)
1. We set up a software using a corrupted buildout ... ok
test_remove_software (slapos.tests.test_slapgrid.TestSlapgridSoftwareRelease) ... ok
test_remove_software_chmod (slapos.tests.test_slapgrid.TestSlapgridSoftwareRelease) ... ok
test_software_install_generate_buildout_cfg_with_shared_part_list (slapos.tests.test_slapgrid.TestSlapgridSoftwareRelease) ... ok
test_partition_list_is_complete_if_empty_destroyed_partition (slapos.tests.test_slapgrid.TestSlapgridUsageReport)
Test that an empty partition with destroyed state but with SR informations ... ok
test_slapgrid_destroys_instance_to_be_destroyed (slapos.tests.test_slapgrid.TestSlapgridUsageReport)
Test than an instance in "destroyed" state is correctly destroyed ... ok
test_slapgrid_instance_ignore_free_instance (slapos.tests.test_slapgrid.TestSlapgridUsageReport)
Test than a free instance (so in "destroyed" state, but empty, without ... ok
test_slapgrid_not_destroy_bad_instance (slapos.tests.test_slapgrid.TestSlapgridUsageReport)
Checks that slapgrid-ur don't destroy instance not to be destroyed. ... ok
test_slapgrid_report_ignore_free_instance (slapos.tests.test_slapgrid.TestSlapgridUsageReport)
Test than a free instance (so in "destroyed" state, but empty, without ... ok
test (slapos.tests.test_slapgrid.TestSlapgridWithDevPerm) ... ok
test_bad_link (slapos.tests.test_slapgrid.TestSlapgridWithDevPerm) ... ok
test_link (slapos.tests.test_slapgrid.TestSlapgridWithDevPerm) ... ok
test_long (slapos.tests.test_slapgrid.TestSlapgridWithDevPerm) ... ok
test_not_existing (slapos.tests.test_slapgrid.TestSlapgridWithDevPerm) ... ok
test (slapos.tests.test_slapgrid.TestSlapgridWithDevPermManagerDevPermAllow) ... ok
test_bad_link (slapos.tests.test_slapgrid.TestSlapgridWithDevPermManagerDevPermAllow) ... ok
test_link (slapos.tests.test_slapgrid.TestSlapgridWithDevPermManagerDevPermAllow) ... ok
test_long (slapos.tests.test_slapgrid.TestSlapgridWithDevPermManagerDevPermAllow) ... ok
test_not_existing (slapos.tests.test_slapgrid.TestSlapgridWithDevPermManagerDevPermAllow) ... ok
test (slapos.tests.test_slapgrid.TestSlapgridWithDevPermManagerDevPermDisallow) ... ok
test_bad_link (slapos.tests.test_slapgrid.TestSlapgridWithDevPermManagerDevPermDisallow) ... ok
test_link (slapos.tests.test_slapgrid.TestSlapgridWithDevPermManagerDevPermDisallow) ... ok
test_long (slapos.tests.test_slapgrid.TestSlapgridWithDevPermManagerDevPermDisallow) ... ok
test_not_existing (slapos.tests.test_slapgrid.TestSlapgridWithDevPermManagerDevPermDisallow) ... ok
test (slapos.tests.test_slapgrid.TestSlapgridWithDevPermManagerDevPermEmpty) ... ok
test_bad_link (slapos.tests.test_slapgrid.TestSlapgridWithDevPermManagerDevPermEmpty) ... ok
test_link (slapos.tests.test_slapgrid.TestSlapgridWithDevPermManagerDevPermEmpty) ... ok
test_long (slapos.tests.test_slapgrid.TestSlapgridWithDevPermManagerDevPermEmpty) ... ok
test_not_existing (slapos.tests.test_slapgrid.TestSlapgridWithDevPermManagerDevPermEmpty) ... ok
test (slapos.tests.test_slapgrid.TestSlapgridWithDevPermManagerDevPermListEmpty) ... ok
test_bad_link (slapos.tests.test_slapgrid.TestSlapgridWithDevPermManagerDevPermListEmpty) ... ok
test_link (slapos.tests.test_slapgrid.TestSlapgridWithDevPermManagerDevPermListEmpty) ... ok
test_long (slapos.tests.test_slapgrid.TestSlapgridWithDevPermManagerDevPermListEmpty) ... ok
test_not_existing (slapos.tests.test_slapgrid.TestSlapgridWithDevPermManagerDevPermListEmpty) ... ok
test_ipv6_port_redirection (slapos.tests.test_slapgrid.TestSlapgridWithPortRedirection) ... ok
test_port_redirection_config_bad_dest_address (slapos.tests.test_slapgrid.TestSlapgridWithPortRedirection) ... ok
test_port_redirection_config_bad_dest_port (slapos.tests.test_slapgrid.TestSlapgridWithPortRedirection) ... ok
test_port_redirection_config_bad_redir_type (slapos.tests.test_slapgrid.TestSlapgridWithPortRedirection) ... ok
test_port_redirection_config_bad_source_address (slapos.tests.test_slapgrid.TestSlapgridWithPortRedirection) ... ok
test_port_redirection_config_bad_source_port (slapos.tests.test_slapgrid.TestSlapgridWithPortRedirection) ... ok
test_portredir_config_change (slapos.tests.test_slapgrid.TestSlapgridWithPortRedirection) ... ok
test_simple_port_redirection (slapos.tests.test_slapgrid.TestSlapgridWithPortRedirection) ... ok
test_udp_port_redirection (slapos.tests.test_slapgrid.TestSlapgridWithPortRedirection) ... ok
test_construct_empty (slapos.tests.test_slapformat.TestComputer) ... skipped 'Not implemented'
test_construct_empty_prepared (slapos.tests.test_slapformat.TestComputer) ... skipped 'Not implemented'
test_construct_empty_prepared_no_alter_network (slapos.tests.test_slapformat.TestComputer) ... skipped 'Not implemented'
test_construct_empty_prepared_no_alter_network_user (slapos.tests.test_slapformat.TestComputer) ... ok
test_construct_empty_prepared_no_alter_user (slapos.tests.test_slapformat.TestComputer) ... ok
test_construct_prepared (slapos.tests.test_slapformat.TestComputer) ... skipped 'Not implemented'
test_construct_prepared_no_alter_network (slapos.tests.test_slapformat.TestComputer) ... skipped 'Not implemented'
test_construct_prepared_no_alter_network_user (slapos.tests.test_slapformat.TestComputer) ... ok
test_construct_prepared_no_alter_user (slapos.tests.test_slapformat.TestComputer) ... ok
test_construct_prepared_tap_no_alter_user (slapos.tests.test_slapformat.TestComputer) ... ok
test_construct_use_unique_local_address_block (slapos.tests.test_slapformat.TestComputer)
Test that slapformat creates a unique local address in the interface. ... ok
test_getAddress_empty_computer (slapos.tests.test_slapformat.TestComputer) ... ok
test_positive_cgroups (slapos.tests.test_slapformat.TestComputerWithCPUSet)
Positive test of cgroups. ... ok
test_cmdline1_options (slapos.tests.test_slapformat.TestFormatConfig) ... /srv/slapgrid/slappart7/srv/testnode/cum/inst/test0-0/parts/slapos.core/slapos/cli/config.py:80: DeprecationWarning: The SafeConfigParser class has been renamed to ConfigParser in Python 3.2. This alias will be removed in future versions. Use ConfigParser directly instead.
configp = configparser.SafeConfigParser()
ok
test_empty_cmdline_options (slapos.tests.test_slapformat.TestFormatConfig) ... ok
test_createPath_no_alter_user (slapos.tests.test_slapformat.TestPartition) ... ok
test_partition_format (slapos.tests.test_slapformat.TestSlapformatManagerLifecycle) ... ok
test_create (slapos.tests.test_slapformat.TestUser) ... ok
test_create_additional_groups (slapos.tests.test_slapformat.TestUser) ... ok
test_create_group_exists (slapos.tests.test_slapformat.TestUser) ... ok
test_create_user_exists (slapos.tests.test_slapformat.TestUser) ... ok
test_create_user_exists_additional_groups (slapos.tests.test_slapformat.TestUser) ... ok
test_create_user_group_exists (slapos.tests.test_slapformat.TestUser) ... ok
test_isAvailable (slapos.tests.test_slapformat.TestUser) ... ok
test_isAvailable_notAvailable (slapos.tests.test_slapformat.TestUser) ... ok
test_ComputerPartition_declares_interface (slapos.tests.test_interface.TestInterface) ... ok
test_ComputerPartition_implements_slapos.slap.interface.slap.IComputerPartition (slapos.tests.test_interface.TestInterface) ... ok
test_ComputerPartition_only_implements (slapos.tests.test_interface.TestInterface) ... ok
test_Computer_declares_interface (slapos.tests.test_interface.TestInterface) ... ok
test_Computer_implements_slapos.slap.interface.slap.IComputer (slapos.tests.test_interface.TestInterface) ... ok
test_Computer_only_implements (slapos.tests.test_interface.TestInterface) ... ok
test_ConnectionError_declares_interface (slapos.tests.test_interface.TestInterface) ... ok
test_ConnectionError_implements_slapos.slap.interface.slap.IConnectionError (slapos.tests.test_interface.TestInterface) ... ok
test_ConnectionError_only_implements (slapos.tests.test_interface.TestInterface) ... ok
test_NotFoundError_declares_interface (slapos.tests.test_interface.TestInterface) ... ok
test_NotFoundError_implements_slapos.slap.interface.slap.INotFoundError (slapos.tests.test_interface.TestInterface) ... ok
test_NotFoundError_only_implements (slapos.tests.test_interface.TestInterface) ... ok
test_OpenOrder_declares_interface (slapos.tests.test_interface.TestInterface) ... ok
test_OpenOrder_implements_slapos.slap.interface.slap.IOpenOrder (slapos.tests.test_interface.TestInterface) ... ok
test_OpenOrder_only_implements (slapos.tests.test_interface.TestInterface) ... ok
test_ResourceNotReady_declares_interface (slapos.tests.test_interface.TestInterface) ... ok
test_ResourceNotReady_implements_slapos.slap.interface.slap.IResourceNotReady (slapos.tests.test_interface.TestInterface) ... ok
test_ResourceNotReady_only_implements (slapos.tests.test_interface.TestInterface) ... ok
test_ServerError_declares_interface (slapos.tests.test_interface.TestInterface) ... ok
test_ServerError_implements_slapos.slap.interface.slap.IServerError (slapos.tests.test_interface.TestInterface) ... ok
test_ServerError_only_implements (slapos.tests.test_interface.TestInterface) ... ok
test_SoftwareInstance_declares_interface (slapos.tests.test_interface.TestInterface) ... ok
test_SoftwareInstance_implements_slapos.slap.interface.slap.ISoftwareInstance (slapos.tests.test_interface.TestInterface) ... ok
test_SoftwareInstance_only_implements (slapos.tests.test_interface.TestInterface) ... ok
test_SoftwareProductCollection_declares_interface (slapos.tests.test_interface.TestInterface) ... ok
test_SoftwareProductCollection_implements_slapos.slap.interface.slap.ISoftwareProductCollection (slapos.tests.test_interface.TestInterface) ... ok
test_SoftwareProductCollection_only_implements (slapos.tests.test_interface.TestInterface) ... ok
test_SoftwareRelease_declares_interface (slapos.tests.test_interface.TestInterface) ... ok
test_SoftwareRelease_implements_slapos.slap.interface.slap.ISoftwareRelease (slapos.tests.test_interface.TestInterface) ... ok
test_SoftwareRelease_only_implements (slapos.tests.test_interface.TestInterface) ... ok
test_Supply_declares_interface (slapos.tests.test_interface.TestInterface) ... ok
test_Supply_implements_slapos.slap.interface.slap.ISupply (slapos.tests.test_interface.TestInterface) ... ok
test_Supply_only_implements (slapos.tests.test_interface.TestInterface) ... ok
test_Token_declares_interface (slapos.tests.test_interface.TestInterface) ... ok
test_Token_implements_slapos.slap.interface.slap.IToken (slapos.tests.test_interface.TestInterface) ... ok
test_Token_only_implements (slapos.tests.test_interface.TestInterface) ... ok
test_slap_declares_interface (slapos.tests.test_interface.TestInterface) ... ok
test_slap_implements_slapos.slap.interface.slap.slap (slapos.tests.test_interface.TestInterface) ... ok
test_slap_only_implements (slapos.tests.test_interface.TestInterface) ... ok
test_database_bootstrap (slapos.tests.test_collect.TestCollectDatabase) ... ok
test_database_not_bootstrap (slapos.tests.test_collect.TestCollectDatabase) ... ok
test_database_select (slapos.tests.test_collect.TestCollectDatabase) ... ok
test_date_scope (slapos.tests.test_collect.TestCollectDatabase) ... ok
test_garbage (slapos.tests.test_collect.TestCollectDatabase) ... ok
test_garbage_collection_date_list (slapos.tests.test_collect.TestCollectDatabase) ... ok
test_insert_computer_snapshot (slapos.tests.test_collect.TestCollectDatabase) ... ok
test_insert_disk_partition_snapshot (slapos.tests.test_collect.TestCollectDatabase) ... ok
test_insert_folder_snapshot (slapos.tests.test_collect.TestCollectDatabase) ... ok
test_insert_system_snapshot (slapos.tests.test_collect.TestCollectDatabase) ... ok
test_insert_user_snapshot (slapos.tests.test_collect.TestCollectDatabase) ... ok
test_mark_day_as_reported (slapos.tests.test_collect.TestCollectDatabase) ... ok
test_computer_entity (slapos.tests.test_collect.TestCollectEntity) ... ok
test_get_user_list (slapos.tests.test_collect.TestCollectEntity) ... ok
test_user_add_snapshot (slapos.tests.test_collect.TestCollectEntity) ... ok
test_user_save (slapos.tests.test_collect.TestCollectEntity) ... ok
test_user_save_disk_snapshot (slapos.tests.test_collect.TestCollectEntity) ... ok
test_user_save_disk_snapshot_cycle (slapos.tests.test_collect.TestCollectEntity) ... ok
test_compress_log_directory (slapos.tests.test_collect.TestCollectReport) ... ok
test_raw_csv_report (slapos.tests.test_collect.TestCollectReport) ... ok
test_system_csv_report (slapos.tests.test_collect.TestCollectReport) ... ok
test_system_json_report (slapos.tests.test_collect.TestCollectReport) ... ok
test_computer_snapshot (slapos.tests.test_collect.TestCollectSnapshot) ... ok
test_folder_size_snapshot (slapos.tests.test_collect.TestCollectSnapshot) ... ok
test_process_snapshot (slapos.tests.test_collect.TestCollectSnapshot) ... ok
test_process_snapshot_broken_process (slapos.tests.test_collect.TestCollectSnapshot) ... ok
test_system_snapshot (slapos.tests.test_collect.TestCollectSnapshot) ... ok
test_buildXMLReport (slapos.tests.test_collect.TestConsumptionReport) ... ok
test_getCpuLoadAverageConsumption (slapos.tests.test_collect.TestConsumptionReport) ... ok
test_getMemoryAverageConsumption (slapos.tests.test_collect.TestConsumptionReport) ... ok
test_getPartitionCPULoadAverage (slapos.tests.test_collect.TestConsumptionReport) ... ok
test_getPartitionConsumptionStatusList (slapos.tests.test_collect.TestConsumptionReport) ... ok
test_getPartitionDiskUsedAverage (slapos.tests.test_collect.TestConsumptionReport) ... ok
test_getPartitionProcessConsumptionList (slapos.tests.test_collect.TestConsumptionReport) ... ok
test_getPartitionUsedMemoryAverage (slapos.tests.test_collect.TestConsumptionReport) ... ok
test_getPartitionCPULoadAverage (slapos.tests.test_collect.TestConsumptionReportBase) ... ok
test_getPartitionConsumptionStatusList (slapos.tests.test_collect.TestConsumptionReportBase) ... ok
test_getPartitionDiskUsedAverage (slapos.tests.test_collect.TestConsumptionReportBase) ... ok
test_getPartitionProcessConsumptionList (slapos.tests.test_collect.TestConsumptionReportBase) ... ok
test_getPartitionUsedMemoryAverage (slapos.tests.test_collect.TestConsumptionReportBase) ... ok
test_journal (slapos.tests.test_collect.TestJournal) ... ok
test_buildJSONMonitorReport (slapos.tests.test_collect.TestPartitionReport) ... ok
test_getPartitionCPULoadAverage (slapos.tests.test_collect.TestPartitionReport) ... ok
test_getPartitionConsumptionStatusList (slapos.tests.test_collect.TestPartitionReport) ... ok
test_getPartitionDiskUsedAverage (slapos.tests.test_collect.TestPartitionReport) ... ok
test_getPartitionProcessConsumptionList (slapos.tests.test_collect.TestPartitionReport) ... ok
test_getPartitionUsedMemoryAverage (slapos.tests.test_collect.TestPartitionReport) ... ok
test_initDataFile (slapos.tests.test_collect.TestPartitionReport) ... ok
test_computerBang (slapos.tests.test_slapproxy.TestInformation)
Tests that computerBang method is implemented in slapproxy. ... /srv/slapgrid/slappart7/srv/testnode/cum/inst/test0-0/parts/slapos.core/slapos/tests/test_slapproxy.py:114: DeprecationWarning: The SafeConfigParser class has been renamed to ConfigParser in Python 3.2. This alias will be removed in future versions. Use ConfigParser directly instead.
configp = configparser.SafeConfigParser()
ok
test_getComputerInformation (slapos.tests.test_slapproxy.TestInformation)
Check that getComputerInformation return a Computer ... ok
test_getComputerInformation_wrong_computer (slapos.tests.test_slapproxy.TestInformation)
Test that computer information won't be given to a requester different ... ok
test_getComputerPartitionCertificate (slapos.tests.test_slapproxy.TestInformation)
Tests that getComputerPartitionCertificate method is implemented in slapproxy. ... ok
test_getFullComputerInformation (slapos.tests.test_slapproxy.TestInformation)
Check that getFullComputerInformation return a Computer ... ok
test_getSoftwareReleaseListFromSoftwareProduct_bothParameter (slapos.tests.test_slapproxy.TestInformation)
Test that a call to getSoftwareReleaseListFromSoftwareProduct with no ... ok
test_getSoftwareReleaseListFromSoftwareProduct_noParameter (slapos.tests.test_slapproxy.TestInformation)
Test that a call to getSoftwareReleaseListFromSoftwareProduct with both ... ok
test_getSoftwareReleaseListFromSoftwareProduct_noSoftwareProduct (slapos.tests.test_slapproxy.TestInformation)
Check that calling getSoftwareReleaseListFromSoftwareProduct() in slapproxy ... ok
test_getSoftwareReleaseListFromSoftwareProduct_software_product_reference (slapos.tests.test_slapproxy.TestInformation)
Check that calling getSoftwareReleaseListFromSoftwareProduct() in slapproxy ... ok
test_partition_are_empty (slapos.tests.test_slapproxy.TestInformation)
Test that empty partition are empty :) ... ok
test_loadComputerConfigurationFromXML_keep_partitions (slapos.tests.test_slapproxy.TestLoadComputerConfiguration) ... ok
test_loadComputerConfigurationFromXML_remove_partitions (slapos.tests.test_slapproxy.TestLoadComputerConfiguration) ... ok
test_automatic_migration (slapos.tests.test_slapproxy.TestMigrateVersion10ToLatest) ... ok
test_computerBang (slapos.tests.test_slapproxy.TestMigrateVersion10ToLatest)
Tests that computerBang method is implemented in slapproxy. ... ok
test_getComputerInformation (slapos.tests.test_slapproxy.TestMigrateVersion10ToLatest)
Check that getComputerInformation return a Computer ... ok
test_getComputerInformation_wrong_computer (slapos.tests.test_slapproxy.TestMigrateVersion10ToLatest)
Test that computer information won't be given to a requester different ... ok
test_getComputerPartitionCertificate (slapos.tests.test_slapproxy.TestMigrateVersion10ToLatest)
Tests that getComputerPartitionCertificate method is implemented in slapproxy. ... ok
test_getFullComputerInformation (slapos.tests.test_slapproxy.TestMigrateVersion10ToLatest)
Check that getFullComputerInformation return a Computer ... ok
test_getSoftwareReleaseListFromSoftwareProduct_bothParameter (slapos.tests.test_slapproxy.TestMigrateVersion10ToLatest)
Test that a call to getSoftwareReleaseListFromSoftwareProduct with no ... ok
test_getSoftwareReleaseListFromSoftwareProduct_noParameter (slapos.tests.test_slapproxy.TestMigrateVersion10ToLatest)
Test that a call to getSoftwareReleaseListFromSoftwareProduct with both ... ok
test_getSoftwareReleaseListFromSoftwareProduct_noSoftwareProduct (slapos.tests.test_slapproxy.TestMigrateVersion10ToLatest)
Check that calling getSoftwareReleaseListFromSoftwareProduct() in slapproxy ... ok
test_getSoftwareReleaseListFromSoftwareProduct_software_product_reference (slapos.tests.test_slapproxy.TestMigrateVersion10ToLatest)
Check that calling getSoftwareReleaseListFromSoftwareProduct() in slapproxy ... ok
test_instance_bang (slapos.tests.test_slapproxy.TestMigrateVersion10ToLatest)
Check that instance bang update the timestamps of all partitions in the ... ok
test_master_instance_with_no_slave (slapos.tests.test_slapproxy.TestMigrateVersion10ToLatest)
Test that a master instance with no requested slave ... ok
test_multi_node_support_change_instance_state (slapos.tests.test_slapproxy.TestMigrateVersion10ToLatest)
Test that destroying an instance (i.e change state) from a Computer doesn't ... ok
test_multi_node_support_different_software_release_list (slapos.tests.test_slapproxy.TestMigrateVersion10ToLatest) ... skipped 'Not implemented'
test_multi_node_support_getComputerInformation (slapos.tests.test_slapproxy.TestMigrateVersion10ToLatest)
Test that computer information will not be given if computer is not registered. ... ok
test_multi_node_support_instance (slapos.tests.test_slapproxy.TestMigrateVersion10ToLatest)
Test that instance request behaves correctly with several ... ok
test_multi_node_support_instance_default_computer (slapos.tests.test_slapproxy.TestMigrateVersion10ToLatest) ... skipped 'Not implemented'
test_multi_node_support_instance_guid (slapos.tests.test_slapproxy.TestMigrateVersion10ToLatest) ... skipped 'Not implemented'
test_multi_node_support_remove_software_release (slapos.tests.test_slapproxy.TestMigrateVersion10ToLatest)
Test that removing a software from a Computer doesn't ... ok
test_multi_node_support_same_reference (slapos.tests.test_slapproxy.TestMigrateVersion10ToLatest)
Test that requesting an instance with same reference to two ... ok
test_multi_node_support_slave_instance (slapos.tests.test_slapproxy.TestMigrateVersion10ToLatest)
Test that slave instances are correctly deployed if SLA is specified ... ok
test_partition_are_empty (slapos.tests.test_slapproxy.TestMigrateVersion10ToLatest) ... skipped 'Not implemented'
test_request_consistent_parameters (slapos.tests.test_slapproxy.TestMigrateVersion10ToLatest) ... skipped 'Not implemented'
test_request_frontend (slapos.tests.test_slapproxy.TestMigrateVersion10ToLatest) ... ok
test_request_kvm_frontend (slapos.tests.test_slapproxy.TestMigrateVersion10ToLatest) ... ok
test_request_parent_started_children_stopped (slapos.tests.test_slapproxy.TestMigrateVersion10ToLatest)
Request will return same partition for two equal requests ... ok
test_request_propagate_partition_state (slapos.tests.test_slapproxy.TestMigrateVersion10ToLatest)
Request will return same partition for two equal requests ... ok
test_request_set_connection_parameters_with_int (slapos.tests.test_slapproxy.TestMigrateVersion10ToLatest)
Verify that request int works in connection parameters ... ok
test_request_with_int (slapos.tests.test_slapproxy.TestMigrateVersion10ToLatest)
Verify that request with int parameters is correctly accepted ... ok
test_request_with_nonascii_parameters (slapos.tests.test_slapproxy.TestMigrateVersion10ToLatest)
Verify that request with non-ascii parameters is correctly accepted ... ok
test_slave_request_destroyed (slapos.tests.test_slapproxy.TestMigrateVersion10ToLatest) ... ok
test_slave_request_instance_guid (slapos.tests.test_slapproxy.TestMigrateVersion10ToLatest)
Test that instance_guid support behaves correctly. ... ok
test_slave_request_no_corresponding_partition (slapos.tests.test_slapproxy.TestMigrateVersion10ToLatest)
Slave instance request will fail if no corresponding are found ... ok
test_slave_request_one_corresponding_partition (slapos.tests.test_slapproxy.TestMigrateVersion10ToLatest)
Successfull request slave instance follow these steps: ... ok
test_slave_request_set_connection_parameters (slapos.tests.test_slapproxy.TestMigrateVersion10ToLatest)
Parameters set in slave instance by master instance must be put in slave instance connection parameters. ... ok
test_slave_request_set_parameters (slapos.tests.test_slapproxy.TestMigrateVersion10ToLatest)
Parameters sent in slave request must be put in slave master ... ok
test_slave_request_set_parameters_are_updated (slapos.tests.test_slapproxy.TestMigrateVersion10ToLatest)
Parameters sent in slave request must be put in slave master ... ok
test_slave_request_updates_timestamp (slapos.tests.test_slapproxy.TestMigrateVersion10ToLatest) ... ok
test_two_different_request_from_one_partition (slapos.tests.test_slapproxy.TestMigrateVersion10ToLatest)
Two different request from same partition ... ok
test_two_different_request_from_two_partition (slapos.tests.test_slapproxy.TestMigrateVersion10ToLatest)
Since slapproxy does not implement scope, two request with ... ok
test_two_request_one_partition_free (slapos.tests.test_slapproxy.TestMigrateVersion10ToLatest)
Since slapproxy does not implement scope, providing two partition_id ... ok
test_two_request_two_partition_free (slapos.tests.test_slapproxy.TestMigrateVersion10ToLatest)
If two requests are made with two available partition ... ok
test_two_requests_with_different_parameters_and_sr_url_but_same_reference (slapos.tests.test_slapproxy.TestMigrateVersion10ToLatest)
Request will return same partition for two different requests but will ... ok
test_two_requests_with_different_parameters_but_same_reference (slapos.tests.test_slapproxy.TestMigrateVersion10ToLatest)
Request will return same partition for two different requests but will ... ok
test_two_same_request_from_one_partition (slapos.tests.test_slapproxy.TestMigrateVersion10ToLatest)
Request will return same partition for two equal requests ... ok
test_automatic_migration (slapos.tests.test_slapproxy.TestMigrateVersion11ToLatest) ... ok
test_computerBang (slapos.tests.test_slapproxy.TestMigrateVersion11ToLatest)
Tests that computerBang method is implemented in slapproxy. ... ok
test_getComputerInformation (slapos.tests.test_slapproxy.TestMigrateVersion11ToLatest)
Check that getComputerInformation return a Computer ... ok
test_getComputerInformation_wrong_computer (slapos.tests.test_slapproxy.TestMigrateVersion11ToLatest)
Test that computer information won't be given to a requester different ... ok
test_getComputerPartitionCertificate (slapos.tests.test_slapproxy.TestMigrateVersion11ToLatest)
Tests that getComputerPartitionCertificate method is implemented in slapproxy. ... ok
test_getFullComputerInformation (slapos.tests.test_slapproxy.TestMigrateVersion11ToLatest)
Check that getFullComputerInformation return a Computer ... ok
test_getSoftwareReleaseListFromSoftwareProduct_bothParameter (slapos.tests.test_slapproxy.TestMigrateVersion11ToLatest)
Test that a call to getSoftwareReleaseListFromSoftwareProduct with no ... ok
test_getSoftwareReleaseListFromSoftwareProduct_noParameter (slapos.tests.test_slapproxy.TestMigrateVersion11ToLatest)
Test that a call to getSoftwareReleaseListFromSoftwareProduct with both ... ok
test_getSoftwareReleaseListFromSoftwareProduct_noSoftwareProduct (slapos.tests.test_slapproxy.TestMigrateVersion11ToLatest)
Check that calling getSoftwareReleaseListFromSoftwareProduct() in slapproxy ... ok
test_getSoftwareReleaseListFromSoftwareProduct_software_product_reference (slapos.tests.test_slapproxy.TestMigrateVersion11ToLatest)
Check that calling getSoftwareReleaseListFromSoftwareProduct() in slapproxy ... ok
test_instance_bang (slapos.tests.test_slapproxy.TestMigrateVersion11ToLatest)
Check that instance bang update the timestamps of all partitions in the ... ok
test_master_instance_with_no_slave (slapos.tests.test_slapproxy.TestMigrateVersion11ToLatest)
Test that a master instance with no requested slave ... ok
test_multi_node_support_change_instance_state (slapos.tests.test_slapproxy.TestMigrateVersion11ToLatest)
Test that destroying an instance (i.e change state) from a Computer doesn't ... ok
test_multi_node_support_different_software_release_list (slapos.tests.test_slapproxy.TestMigrateVersion11ToLatest) ... skipped 'Not implemented'
test_multi_node_support_getComputerInformation (slapos.tests.test_slapproxy.TestMigrateVersion11ToLatest)
Test that computer information will not be given if computer is not registered. ... ok
test_multi_node_support_instance (slapos.tests.test_slapproxy.TestMigrateVersion11ToLatest)
Test that instance request behaves correctly with several ... ok
test_multi_node_support_instance_default_computer (slapos.tests.test_slapproxy.TestMigrateVersion11ToLatest) ... skipped 'Not implemented'
test_multi_node_support_instance_guid (slapos.tests.test_slapproxy.TestMigrateVersion11ToLatest) ... skipped 'Not implemented'
test_multi_node_support_remove_software_release (slapos.tests.test_slapproxy.TestMigrateVersion11ToLatest)
Test that removing a software from a Computer doesn't ... ok
test_multi_node_support_same_reference (slapos.tests.test_slapproxy.TestMigrateVersion11ToLatest)
Test that requesting an instance with same reference to two ... ok
test_multi_node_support_slave_instance (slapos.tests.test_slapproxy.TestMigrateVersion11ToLatest)
Test that slave instances are correctly deployed if SLA is specified ... ok
test_partition_are_empty (slapos.tests.test_slapproxy.TestMigrateVersion11ToLatest) ... skipped 'Not implemented'
test_request_consistent_parameters (slapos.tests.test_slapproxy.TestMigrateVersion11ToLatest) ... skipped 'Not implemented'
test_request_frontend (slapos.tests.test_slapproxy.TestMigrateVersion11ToLatest) ... ok
test_request_kvm_frontend (slapos.tests.test_slapproxy.TestMigrateVersion11ToLatest) ... ok
test_request_parent_started_children_stopped (slapos.tests.test_slapproxy.TestMigrateVersion11ToLatest)
Request will return same partition for two equal requests ... ok
test_request_propagate_partition_state (slapos.tests.test_slapproxy.TestMigrateVersion11ToLatest)
Request will return same partition for two equal requests ... ok
test_request_set_connection_parameters_with_int (slapos.tests.test_slapproxy.TestMigrateVersion11ToLatest)
Verify that request int works in connection parameters ... ok
test_request_with_int (slapos.tests.test_slapproxy.TestMigrateVersion11ToLatest)
Verify that request with int parameters is correctly accepted ... ok
test_request_with_nonascii_parameters (slapos.tests.test_slapproxy.TestMigrateVersion11ToLatest)
Verify that request with non-ascii parameters is correctly accepted ... ok
test_slave_request_destroyed (slapos.tests.test_slapproxy.TestMigrateVersion11ToLatest) ... ok
test_slave_request_instance_guid (slapos.tests.test_slapproxy.TestMigrateVersion11ToLatest)
Test that instance_guid support behaves correctly. ... ok
test_slave_request_no_corresponding_partition (slapos.tests.test_slapproxy.TestMigrateVersion11ToLatest)
Slave instance request will fail if no corresponding are found ... ok
test_slave_request_one_corresponding_partition (slapos.tests.test_slapproxy.TestMigrateVersion11ToLatest)
Successfull request slave instance follow these steps: ... ok
test_slave_request_set_connection_parameters (slapos.tests.test_slapproxy.TestMigrateVersion11ToLatest)
Parameters set in slave instance by master instance must be put in slave instance connection parameters. ... ok
test_slave_request_set_parameters (slapos.tests.test_slapproxy.TestMigrateVersion11ToLatest)
Parameters sent in slave request must be put in slave master ... ok
test_slave_request_set_parameters_are_updated (slapos.tests.test_slapproxy.TestMigrateVersion11ToLatest)
Parameters sent in slave request must be put in slave master ... ok
test_slave_request_updates_timestamp (slapos.tests.test_slapproxy.TestMigrateVersion11ToLatest) ... ok
test_two_different_request_from_one_partition (slapos.tests.test_slapproxy.TestMigrateVersion11ToLatest)
Two different request from same partition ... ok
test_two_different_request_from_two_partition (slapos.tests.test_slapproxy.TestMigrateVersion11ToLatest)
Since slapproxy does not implement scope, two request with ... ok
test_two_request_one_partition_free (slapos.tests.test_slapproxy.TestMigrateVersion11ToLatest)
Since slapproxy does not implement scope, providing two partition_id ... ok
test_two_request_two_partition_free (slapos.tests.test_slapproxy.TestMigrateVersion11ToLatest)
If two requests are made with two available partition ... ok
test_two_requests_with_different_parameters_and_sr_url_but_same_reference (slapos.tests.test_slapproxy.TestMigrateVersion11ToLatest)
Request will return same partition for two different requests but will ... ok
test_two_requests_with_different_parameters_but_same_reference (slapos.tests.test_slapproxy.TestMigrateVersion11ToLatest)
Request will return same partition for two different requests but will ... ok
test_two_same_request_from_one_partition (slapos.tests.test_slapproxy.TestMigrateVersion11ToLatest)
Request will return same partition for two equal requests ... ok
test_automatic_migration (slapos.tests.test_slapproxy.TestMigrateVersion12ToLatest) ... ok
test_computerBang (slapos.tests.test_slapproxy.TestMigrateVersion12ToLatest)
Tests that computerBang method is implemented in slapproxy. ... ok
test_getComputerInformation (slapos.tests.test_slapproxy.TestMigrateVersion12ToLatest)
Check that getComputerInformation return a Computer ... ok
test_getComputerInformation_wrong_computer (slapos.tests.test_slapproxy.TestMigrateVersion12ToLatest)
Test that computer information won't be given to a requester different ... ok
test_getComputerPartitionCertificate (slapos.tests.test_slapproxy.TestMigrateVersion12ToLatest)
Tests that getComputerPartitionCertificate method is implemented in slapproxy. ... ok
test_getFullComputerInformation (slapos.tests.test_slapproxy.TestMigrateVersion12ToLatest)
Check that getFullComputerInformation return a Computer ... ok
test_getSoftwareReleaseListFromSoftwareProduct_bothParameter (slapos.tests.test_slapproxy.TestMigrateVersion12ToLatest)
Test that a call to getSoftwareReleaseListFromSoftwareProduct with no ... ok
test_getSoftwareReleaseListFromSoftwareProduct_noParameter (slapos.tests.test_slapproxy.TestMigrateVersion12ToLatest)
Test that a call to getSoftwareReleaseListFromSoftwareProduct with both ... ok
test_getSoftwareReleaseListFromSoftwareProduct_noSoftwareProduct (slapos.tests.test_slapproxy.TestMigrateVersion12ToLatest)
Check that calling getSoftwareReleaseListFromSoftwareProduct() in slapproxy ... ok
test_getSoftwareReleaseListFromSoftwareProduct_software_product_reference (slapos.tests.test_slapproxy.TestMigrateVersion12ToLatest)
Check that calling getSoftwareReleaseListFromSoftwareProduct() in slapproxy ... ok
test_instance_bang (slapos.tests.test_slapproxy.TestMigrateVersion12ToLatest)
Check that instance bang update the timestamps of all partitions in the ... ok
test_master_instance_with_no_slave (slapos.tests.test_slapproxy.TestMigrateVersion12ToLatest)
Test that a master instance with no requested slave ... ok
test_multi_node_support_change_instance_state (slapos.tests.test_slapproxy.TestMigrateVersion12ToLatest)
Test that destroying an instance (i.e change state) from a Computer doesn't ... ok
test_multi_node_support_different_software_release_list (slapos.tests.test_slapproxy.TestMigrateVersion12ToLatest) ... skipped 'Not implemented'
test_multi_node_support_getComputerInformation (slapos.tests.test_slapproxy.TestMigrateVersion12ToLatest)
Test that computer information will not be given if computer is not registered. ... ok
test_multi_node_support_instance (slapos.tests.test_slapproxy.TestMigrateVersion12ToLatest)
Test that instance request behaves correctly with several ... ok
test_multi_node_support_instance_default_computer (slapos.tests.test_slapproxy.TestMigrateVersion12ToLatest) ... skipped 'Not implemented'
test_multi_node_support_instance_guid (slapos.tests.test_slapproxy.TestMigrateVersion12ToLatest) ... skipped 'Not implemented'
test_multi_node_support_remove_software_release (slapos.tests.test_slapproxy.TestMigrateVersion12ToLatest)
Test that removing a software from a Computer doesn't ... ok
test_multi_node_support_same_reference (slapos.tests.test_slapproxy.TestMigrateVersion12ToLatest)
Test that requesting an instance with same reference to two ... ok
test_multi_node_support_slave_instance (slapos.tests.test_slapproxy.TestMigrateVersion12ToLatest)
Test that slave instances are correctly deployed if SLA is specified ... ok
test_partition_are_empty (slapos.tests.test_slapproxy.TestMigrateVersion12ToLatest) ... skipped 'Not implemented'
test_request_consistent_parameters (slapos.tests.test_slapproxy.TestMigrateVersion12ToLatest) ... skipped 'Not implemented'
test_request_frontend (slapos.tests.test_slapproxy.TestMigrateVersion12ToLatest) ... ok
test_request_kvm_frontend (slapos.tests.test_slapproxy.TestMigrateVersion12ToLatest) ... ok
test_request_parent_started_children_stopped (slapos.tests.test_slapproxy.TestMigrateVersion12ToLatest)
Request will return same partition for two equal requests ... ok
test_request_propagate_partition_state (slapos.tests.test_slapproxy.TestMigrateVersion12ToLatest)
Request will return same partition for two equal requests ... ok
test_request_set_connection_parameters_with_int (slapos.tests.test_slapproxy.TestMigrateVersion12ToLatest)
Verify that request int works in connection parameters ... ok
test_request_with_int (slapos.tests.test_slapproxy.TestMigrateVersion12ToLatest)
Verify that request with int parameters is correctly accepted ... ok
test_request_with_nonascii_parameters (slapos.tests.test_slapproxy.TestMigrateVersion12ToLatest)
Verify that request with non-ascii parameters is correctly accepted ... ok
test_slave_request_destroyed (slapos.tests.test_slapproxy.TestMigrateVersion12ToLatest) ... ok
test_slave_request_instance_guid (slapos.tests.test_slapproxy.TestMigrateVersion12ToLatest)
Test that instance_guid support behaves correctly. ... ok
test_slave_request_no_corresponding_partition (slapos.tests.test_slapproxy.TestMigrateVersion12ToLatest)
Slave instance request will fail if no corresponding are found ... ok
test_slave_request_one_corresponding_partition (slapos.tests.test_slapproxy.TestMigrateVersion12ToLatest)
Successfull request slave instance follow these steps: ... ok
test_slave_request_set_connection_parameters (slapos.tests.test_slapproxy.TestMigrateVersion12ToLatest)
Parameters set in slave instance by master instance must be put in slave instance connection parameters. ... ok
test_slave_request_set_parameters (slapos.tests.test_slapproxy.TestMigrateVersion12ToLatest)
Parameters sent in slave request must be put in slave master ... ok
test_slave_request_set_parameters_are_updated (slapos.tests.test_slapproxy.TestMigrateVersion12ToLatest)
Parameters sent in slave request must be put in slave master ... ok
test_slave_request_updates_timestamp (slapos.tests.test_slapproxy.TestMigrateVersion12ToLatest) ... ok
test_two_different_request_from_one_partition (slapos.tests.test_slapproxy.TestMigrateVersion12ToLatest)
Two different request from same partition ... ok
test_two_different_request_from_two_partition (slapos.tests.test_slapproxy.TestMigrateVersion12ToLatest)
Since slapproxy does not implement scope, two request with ... ok
test_two_request_one_partition_free (slapos.tests.test_slapproxy.TestMigrateVersion12ToLatest)
Since slapproxy does not implement scope, providing two partition_id ... ok
test_two_request_two_partition_free (slapos.tests.test_slapproxy.TestMigrateVersion12ToLatest)
If two requests are made with two available partition ... ok
test_two_requests_with_different_parameters_and_sr_url_but_same_reference (slapos.tests.test_slapproxy.TestMigrateVersion12ToLatest)
Request will return same partition for two different requests but will ... ok
test_two_requests_with_different_parameters_but_same_reference (slapos.tests.test_slapproxy.TestMigrateVersion12ToLatest)
Request will return same partition for two different requests but will ... ok
test_two_same_request_from_one_partition (slapos.tests.test_slapproxy.TestMigrateVersion12ToLatest)
Request will return same partition for two equal requests ... ok
test_automatic_migration (slapos.tests.test_slapproxy.TestMigrateVersion13ToLatest) ... ok
test_computerBang (slapos.tests.test_slapproxy.TestMigrateVersion13ToLatest)
Tests that computerBang method is implemented in slapproxy. ... ok
test_getComputerInformation (slapos.tests.test_slapproxy.TestMigrateVersion13ToLatest)
Check that getComputerInformation return a Computer ... ok
test_getComputerInformation_wrong_computer (slapos.tests.test_slapproxy.TestMigrateVersion13ToLatest)
Test that computer information won't be given to a requester different ... ok
test_getComputerPartitionCertificate (slapos.tests.test_slapproxy.TestMigrateVersion13ToLatest)
Tests that getComputerPartitionCertificate method is implemented in slapproxy. ... ok
test_getFullComputerInformation (slapos.tests.test_slapproxy.TestMigrateVersion13ToLatest)
Check that getFullComputerInformation return a Computer ... ok
test_getSoftwareReleaseListFromSoftwareProduct_bothParameter (slapos.tests.test_slapproxy.TestMigrateVersion13ToLatest)
Test that a call to getSoftwareReleaseListFromSoftwareProduct with no ... ok
test_getSoftwareReleaseListFromSoftwareProduct_noParameter (slapos.tests.test_slapproxy.TestMigrateVersion13ToLatest)
Test that a call to getSoftwareReleaseListFromSoftwareProduct with both ... ok
test_getSoftwareReleaseListFromSoftwareProduct_noSoftwareProduct (slapos.tests.test_slapproxy.TestMigrateVersion13ToLatest)
Check that calling getSoftwareReleaseListFromSoftwareProduct() in slapproxy ... ok
test_getSoftwareReleaseListFromSoftwareProduct_software_product_reference (slapos.tests.test_slapproxy.TestMigrateVersion13ToLatest)
Check that calling getSoftwareReleaseListFromSoftwareProduct() in slapproxy ... ok
test_instance_bang (slapos.tests.test_slapproxy.TestMigrateVersion13ToLatest)
Check that instance bang update the timestamps of all partitions in the ... ok
test_master_instance_with_no_slave (slapos.tests.test_slapproxy.TestMigrateVersion13ToLatest)
Test that a master instance with no requested slave ... ok
test_multi_node_support_change_instance_state (slapos.tests.test_slapproxy.TestMigrateVersion13ToLatest)
Test that destroying an instance (i.e change state) from a Computer doesn't ... ok
test_multi_node_support_different_software_release_list (slapos.tests.test_slapproxy.TestMigrateVersion13ToLatest) ... skipped 'Not implemented'
test_multi_node_support_getComputerInformation (slapos.tests.test_slapproxy.TestMigrateVersion13ToLatest)
Test that computer information will not be given if computer is not registered. ... ok
test_multi_node_support_instance (slapos.tests.test_slapproxy.TestMigrateVersion13ToLatest)
Test that instance request behaves correctly with several ... ok
test_multi_node_support_instance_default_computer (slapos.tests.test_slapproxy.TestMigrateVersion13ToLatest) ... skipped 'Not implemented'
test_multi_node_support_instance_guid (slapos.tests.test_slapproxy.TestMigrateVersion13ToLatest) ... skipped 'Not implemented'
test_multi_node_support_remove_software_release (slapos.tests.test_slapproxy.TestMigrateVersion13ToLatest)
Test that removing a software from a Computer doesn't ... ok
test_multi_node_support_same_reference (slapos.tests.test_slapproxy.TestMigrateVersion13ToLatest)
Test that requesting an instance with same reference to two ... ok
test_multi_node_support_slave_instance (slapos.tests.test_slapproxy.TestMigrateVersion13ToLatest)
Test that slave instances are correctly deployed if SLA is specified ... ok
test_partition_are_empty (slapos.tests.test_slapproxy.TestMigrateVersion13ToLatest) ... skipped 'Not implemented'
test_request_consistent_parameters (slapos.tests.test_slapproxy.TestMigrateVersion13ToLatest) ... skipped 'Not implemented'
test_request_frontend (slapos.tests.test_slapproxy.TestMigrateVersion13ToLatest) ... ok
test_request_kvm_frontend (slapos.tests.test_slapproxy.TestMigrateVersion13ToLatest) ... ok
test_request_parent_started_children_stopped (slapos.tests.test_slapproxy.TestMigrateVersion13ToLatest)
Request will return same partition for two equal requests ... ok
test_request_propagate_partition_state (slapos.tests.test_slapproxy.TestMigrateVersion13ToLatest)
Request will return same partition for two equal requests ... ok
test_request_set_connection_parameters_with_int (slapos.tests.test_slapproxy.TestMigrateVersion13ToLatest)
Verify that request int works in connection parameters ... ok
test_request_with_int (slapos.tests.test_slapproxy.TestMigrateVersion13ToLatest)
Verify that request with int parameters is correctly accepted ... ok
test_request_with_nonascii_parameters (slapos.tests.test_slapproxy.TestMigrateVersion13ToLatest)
Verify that request with non-ascii parameters is correctly accepted ... ok
test_slave_request_destroyed (slapos.tests.test_slapproxy.TestMigrateVersion13ToLatest) ... ok
test_slave_request_instance_guid (slapos.tests.test_slapproxy.TestMigrateVersion13ToLatest)
Test that instance_guid support behaves correctly. ... ok
test_slave_request_no_corresponding_partition (slapos.tests.test_slapproxy.TestMigrateVersion13ToLatest)
Slave instance request will fail if no corresponding are found ... ok
test_slave_request_one_corresponding_partition (slapos.tests.test_slapproxy.TestMigrateVersion13ToLatest)
Successfull request slave instance follow these steps: ... ok
test_slave_request_set_connection_parameters (slapos.tests.test_slapproxy.TestMigrateVersion13ToLatest)
Parameters set in slave instance by master instance must be put in slave instance connection parameters. ... ok
test_slave_request_set_parameters (slapos.tests.test_slapproxy.TestMigrateVersion13ToLatest)
Parameters sent in slave request must be put in slave master ... ok
test_slave_request_set_parameters_are_updated (slapos.tests.test_slapproxy.TestMigrateVersion13ToLatest)
Parameters sent in slave request must be put in slave master ... ok
test_slave_request_updates_timestamp (slapos.tests.test_slapproxy.TestMigrateVersion13ToLatest) ... ok
test_two_different_request_from_one_partition (slapos.tests.test_slapproxy.TestMigrateVersion13ToLatest)
Two different request from same partition ... ok
test_two_different_request_from_two_partition (slapos.tests.test_slapproxy.TestMigrateVersion13ToLatest)
Since slapproxy does not implement scope, two request with ... ok
test_two_request_one_partition_free (slapos.tests.test_slapproxy.TestMigrateVersion13ToLatest)
Since slapproxy does not implement scope, providing two partition_id ... ok
test_two_request_two_partition_free (slapos.tests.test_slapproxy.TestMigrateVersion13ToLatest)
If two requests are made with two available partition ... ok
test_two_requests_with_different_parameters_and_sr_url_but_same_reference (slapos.tests.test_slapproxy.TestMigrateVersion13ToLatest)
Request will return same partition for two different requests but will ... ok
test_two_requests_with_different_parameters_but_same_reference (slapos.tests.test_slapproxy.TestMigrateVersion13ToLatest)
Request will return same partition for two different requests but will ... ok
test_two_same_request_from_one_partition (slapos.tests.test_slapproxy.TestMigrateVersion13ToLatest)
Request will return same partition for two equal requests ... ok
testForwardRequestFromPartition (slapos.tests.test_slapproxy.TestMultiMasterSupport)
Test that instance request is forwarded and requested from computer partition. ... ok
/srv/slapgrid/slappart7/srv/testnode/cum/shared/python3/3c76e4d5caeddddc982d72375e043ecc/lib/python3.7/subprocess.py:883: ResourceWarning: subprocess 14686 is still running
ResourceWarning, source=self)
ResourceWarning: Enable tracemalloc to get the object allocation traceback
testForwardRequest_SoftwareReleaseList (slapos.tests.test_slapproxy.TestMultiMasterSupport)
Test that instance request is automatically forwarded ... ok
/srv/slapgrid/slappart7/srv/testnode/cum/shared/python3/3c76e4d5caeddddc982d72375e043ecc/lib/python3.7/subprocess.py:883: ResourceWarning: subprocess 15018 is still running
ResourceWarning, source=self)
ResourceWarning: Enable tracemalloc to get the object allocation traceback
testForwardToMasterInList (slapos.tests.test_slapproxy.TestMultiMasterSupport)
Test that explicitely asking a master_url in SLA causes ... ok
testForwardToMasterNotInList (slapos.tests.test_slapproxy.TestMultiMasterSupport)
Test that explicitely asking a master_url in SLA causes ... /srv/slapgrid/slappart7/srv/testnode/cum/shared/python3/3c76e4d5caeddddc982d72375e043ecc/lib/python3.7/subprocess.py:883: ResourceWarning: subprocess 15350 is still running
ResourceWarning, source=self)
ResourceWarning: Enable tracemalloc to get the object allocation traceback
ok
testRequestExplicitelyOnExternalMasterThenRequestAgain (slapos.tests.test_slapproxy.TestMultiMasterSupport)
Request an instance that will get forwarded to another an instance. ... ok
testRequestToCurrentMaster (slapos.tests.test_slapproxy.TestMultiMasterSupport)
Explicitely ask deployment of an instance to current master ... ok
test_multi_node_support_change_instance_state (slapos.tests.test_slapproxy.TestMultiNodeSupport)
Test that destroying an instance (i.e change state) from a Computer doesn't ... ok
test_multi_node_support_different_software_release_list (slapos.tests.test_slapproxy.TestMultiNodeSupport)
Test that two different registered computers have their own ... ok
test_multi_node_support_getComputerInformation (slapos.tests.test_slapproxy.TestMultiNodeSupport)
Test that computer information will not be given if computer is not registered. ... ok
test_multi_node_support_instance (slapos.tests.test_slapproxy.TestMultiNodeSupport)
Test that instance request behaves correctly with several ... ok
test_multi_node_support_instance_default_computer (slapos.tests.test_slapproxy.TestMultiNodeSupport)
Test that instance request behaves correctly with default computer ... ok
test_multi_node_support_instance_guid (slapos.tests.test_slapproxy.TestMultiNodeSupport)
Test that instance_guid support behaves correctly with multiple nodes. ... ok
test_multi_node_support_remove_software_release (slapos.tests.test_slapproxy.TestMultiNodeSupport)
Test that removing a software from a Computer doesn't ... ok
test_multi_node_support_same_reference (slapos.tests.test_slapproxy.TestMultiNodeSupport)
Test that requesting an instance with same reference to two ... ok
test_multi_node_support_slave_instance (slapos.tests.test_slapproxy.TestMultiNodeSupport)
Test that slave instances are correctly deployed if SLA is specified ... ok
test_instance_bang (slapos.tests.test_slapproxy.TestRequest)
Check that instance bang update the timestamps of all partitions in the ... ok
test_request_consistent_parameters (slapos.tests.test_slapproxy.TestRequest)
Check that all different parameters related to requests (like instance_guid, state) are set and consistent ... ok
test_request_frontend (slapos.tests.test_slapproxy.TestRequest) ... ok
test_request_kvm_frontend (slapos.tests.test_slapproxy.TestRequest) ... ok
test_request_parent_started_children_stopped (slapos.tests.test_slapproxy.TestRequest)
Request will return same partition for two equal requests ... /srv/slapgrid/slappart7/srv/testnode/cum/shared/python3/3c76e4d5caeddddc982d72375e043ecc/lib/python3.7/subprocess.py:883: ResourceWarning: subprocess 16078 is still running
ResourceWarning, source=self)
ResourceWarning: Enable tracemalloc to get the object allocation traceback
ok
test_request_propagate_partition_state (slapos.tests.test_slapproxy.TestRequest)
Request will return same partition for two equal requests ... ok
test_request_set_connection_parameters_with_int (slapos.tests.test_slapproxy.TestRequest)
Verify that request int works in connection parameters ... ok
test_request_with_int (slapos.tests.test_slapproxy.TestRequest)
Verify that request with int parameters is correctly accepted ... ok
test_request_with_nonascii_parameters (slapos.tests.test_slapproxy.TestRequest)
Verify that request with non-ascii parameters is correctly accepted ... ok
test_two_different_request_from_one_partition (slapos.tests.test_slapproxy.TestRequest)
Two different request from same partition ... ok
test_two_different_request_from_two_partition (slapos.tests.test_slapproxy.TestRequest)
Since slapproxy does not implement scope, two request with ... ok
test_two_request_one_partition_free (slapos.tests.test_slapproxy.TestRequest)
Since slapproxy does not implement scope, providing two partition_id ... ok
test_two_request_two_partition_free (slapos.tests.test_slapproxy.TestRequest)
If two requests are made with two available partition ... ok
test_two_requests_with_different_parameters_and_sr_url_but_same_reference (slapos.tests.test_slapproxy.TestRequest)
Request will return same partition for two different requests but will ... ok
test_two_requests_with_different_parameters_but_same_reference (slapos.tests.test_slapproxy.TestRequest)
Request will return same partition for two different requests but will ... ok
test_two_same_request_from_one_partition (slapos.tests.test_slapproxy.TestRequest)
Request will return same partition for two equal requests ... ok
test_master_instance_with_no_slave (slapos.tests.test_slapproxy.TestSlaveRequest)
Test that a master instance with no requested slave ... ok
test_slave_request_destroyed (slapos.tests.test_slapproxy.TestSlaveRequest) ... ok
test_slave_request_instance_guid (slapos.tests.test_slapproxy.TestSlaveRequest)
Test that instance_guid support behaves correctly. ... ok
test_slave_request_no_corresponding_partition (slapos.tests.test_slapproxy.TestSlaveRequest)
Slave instance request will fail if no corresponding are found ... ok
test_slave_request_one_corresponding_partition (slapos.tests.test_slapproxy.TestSlaveRequest)
Successfull request slave instance follow these steps: ... ok
test_slave_request_set_connection_parameters (slapos.tests.test_slapproxy.TestSlaveRequest)
Parameters set in slave instance by master instance must be put in slave instance connection parameters. ... ok
test_slave_request_set_parameters (slapos.tests.test_slapproxy.TestSlaveRequest)
Parameters sent in slave request must be put in slave master ... ok
test_slave_request_set_parameters_are_updated (slapos.tests.test_slapproxy.TestSlaveRequest)
Parameters sent in slave request must be put in slave master ... ok
test_slave_request_updates_timestamp (slapos.tests.test_slapproxy.TestSlaveRequest) ... ok
test_destroyed (slapos.tests.test_slapproxy.TestSoftwareInstallation) ... ok
test_installation_failed (slapos.tests.test_slapproxy.TestSoftwareInstallation) ... ok
test_installation_success (slapos.tests.test_slapproxy.TestSoftwareInstallation) ... ok
test_no_retention_lock_delay (slapos.tests.test_object.TestPartitionDestructionLock) ... ok
test_retention_lock_date_creation (slapos.tests.test_object.TestPartitionDestructionLock) ... ok
test_retention_lock_date_does_not_change (slapos.tests.test_object.TestPartitionDestructionLock) ... ok
test_retention_lock_delay_creation (slapos.tests.test_object.TestPartitionDestructionLock) ... ok
test_retention_lock_delay_does_not_change (slapos.tests.test_object.TestPartitionDestructionLock) ... ok
test_retention_lock_delay_is_respected (slapos.tests.test_object.TestPartitionDestructionLock) ... ok
test (slapos.tests.test_object.TestPartitionDestructionUnwritable) ... ok
test_backward_compatibility_instance_is_deploying_if_template_cfg_is_used (slapos.tests.test_object.TestPartitionSlapObject)
Backward compatibility test, for old software releases. ... ok
test_instance_is_deploying_if_software_release_exists (slapos.tests.test_object.TestPartitionSlapObject)
Test that slapgrid deploys an instance if its Software Release exists and ... ok
test_instance_slapgrid_raise_if_software_release_does_not_exist (slapos.tests.test_object.TestPartitionSlapObject)
Test that slapgrid raises XXX when deploying an instance if the Software Release ... ok
test_instance_slapgrid_raise_if_software_release_instance_profile_does_not_exist (slapos.tests.test_object.TestPartitionSlapObject)
Test that slapgrid raises XXX when deploying an instance if the Software Release ... ok
test_grouped_program (slapos.tests.test_object.TestPartitionSupervisorConfig) ... ok
test_simple_service (slapos.tests.test_object.TestPartitionSupervisorConfig) ... ok
test_software_install_networkcache_upload_blacklist (slapos.tests.test_object.TestSoftwareNetworkCacheSlapObject)
Check if the networkcache upload blacklist parameters are propagated. ... ok
test_software_install_networkcache_upload_blacklist_side_effect (slapos.tests.test_object.TestSoftwareNetworkCacheSlapObject)
Check if the networkcache upload blacklist parameters only prevent ... ok
test_software_install_with_networkcache (slapos.tests.test_object.TestSoftwareNetworkCacheSlapObject)
Check if the networkcache parameters are propagated. ... ok
test_software_install_without_networkcache (slapos.tests.test_object.TestSoftwareNetworkCacheSlapObject)
Check if the networkcache parameters are not propagated if they are not ... ok
testCodeConsistency (slapos.tests.test_pyflakes.CheckCodeConsistency) ... skipped 'pyflakes test is disabled'
test_debian_major (slapos.tests.test_distribution.TestDebianize)
On debian, we only care about major release. ... ok
test_centos (slapos.tests.test_distribution.TestOSMatches) ... ok
test_debian (slapos.tests.test_distribution.TestOSMatches) ... ok
test_ubuntu (slapos.tests.test_distribution.TestOSMatches) ... ok
test_debug (slapos.tests.test_grid_utils.SlapPopenTestCase)
Test debug=True, which keeps interactive. ... ok
test_exec (slapos.tests.test_grid_utils.SlapPopenTestCase)
Test command execution with SlapPopen. ... /srv/slapgrid/slappart7/srv/testnode/cum/shared/python3/3c76e4d5caeddddc982d72375e043ecc/lib/python3.7/unittest/case.py:628: ResourceWarning: unclosed file <_io.BufferedReader name=11>
testMethod()
ResourceWarning: Enable tracemalloc to get the object allocation traceback
ok
test_create_simple_promise (slapos.tests.test_promise.TestSlapOSGenericPromise) ... ok
test_promise_anomaly_disabled (slapos.tests.test_promise.TestSlapOSGenericPromise) ... /srv/slapgrid/slappart7/srv/testnode/cum/inst/test0-0/parts/slapos.core/slapos/grid/promise/generic.py:171: ResourceWarning: unclosed file <_io.TextIOWrapper name='/tmp/tmpvo0iqjco/log/my_promise.log' mode='a' encoding='UTF-8'>
self._configureLogger()
ResourceWarning: Enable tracemalloc to get the object allocation traceback
ok
test_promise_cleanup_output_history (slapos.tests.test_promise.TestSlapOSGenericPromise) ... /srv/slapgrid/slappart7/srv/testnode/cum/inst/test0-0/parts/slapos.core/slapos/grid/promise/generic.py:171: ResourceWarning: unclosed file <_io.TextIOWrapper name='/tmp/tmp3g20uxog/log/my_promise.log' mode='a' encoding='UTF-8'>
self._configureLogger()
ResourceWarning: Enable tracemalloc to get the object allocation traceback
ok
test_promise_cleanup_plugin_dir (slapos.tests.test_promise.TestSlapOSGenericPromise) ... /srv/slapgrid/slappart7/srv/testnode/cum/inst/test0-0/parts/slapos.core/slapos/grid/promise/generic.py:171: ResourceWarning: unclosed file <_io.TextIOWrapper name='/tmp/tmp3g20uxog/log/my_promise.log' mode='a' encoding='UTF-8'>
self._configureLogger()
ResourceWarning: Enable tracemalloc to get the object allocation traceback
ok
test_promise_defaulttest (slapos.tests.test_promise.TestSlapOSGenericPromise) ... /srv/slapgrid/slappart7/srv/testnode/cum/inst/test0-0/parts/slapos.core/slapos/grid/promise/generic.py:171: ResourceWarning: unclosed file <_io.TextIOWrapper name='/tmp/tmp3g20uxog/log/my_promise.log' mode='a' encoding='UTF-8'>
self._configureLogger()
ResourceWarning: Enable tracemalloc to get the object allocation traceback
ok
test_promise_defaulttest_anomaly (slapos.tests.test_promise.TestSlapOSGenericPromise) ... /srv/slapgrid/slappart7/srv/testnode/cum/inst/test0-0/parts/slapos.core/slapos/grid/promise/generic.py:171: ResourceWarning: unclosed file <_io.TextIOWrapper name='/tmp/tmpeptzb796/log/my_promise.log' mode='a' encoding='UTF-8'>
self._configureLogger()
ResourceWarning: Enable tracemalloc to get the object allocation traceback
ok
test_promise_defaulttest_error_if_two_fail (slapos.tests.test_promise.TestSlapOSGenericPromise) ... /srv/slapgrid/slappart7/srv/testnode/cum/inst/test0-0/parts/slapos.core/slapos/grid/promise/generic.py:171: ResourceWarning: unclosed file <_io.TextIOWrapper name='/tmp/tmpkl_v115t/log/my_promise.log' mode='a' encoding='UTF-8'>
self._configureLogger()
ResourceWarning: Enable tracemalloc to get the object allocation traceback
/srv/slapgrid/slappart7/srv/testnode/cum/inst/test0-0/parts/slapos.core/slapos/grid/promise/generic.py:171: ResourceWarning: unclosed file <_io.TextIOWrapper name='/tmp/tmpnkk96qvr/log/my_promise.log' mode='a' encoding='UTF-8'>
self._configureLogger()
ResourceWarning: Enable tracemalloc to get the object allocation traceback
ok
test_promise_defaulttest_failure (slapos.tests.test_promise.TestSlapOSGenericPromise) ... ok
test_promise_no_return (slapos.tests.test_promise.TestSlapOSGenericPromise) ... /srv/slapgrid/slappart7/srv/testnode/cum/inst/test0-0/parts/slapos.core/slapos/grid/promise/generic.py:171: ResourceWarning: unclosed file <_io.TextIOWrapper name='/tmp/tmp8p9u3u4i/log/my_promise.log' mode='a' encoding='UTF-8'>
self._configureLogger()
ResourceWarning: Enable tracemalloc to get the object allocation traceback
ok
test_promise_resultfromlog (slapos.tests.test_promise.TestSlapOSGenericPromise) ... /srv/slapgrid/slappart7/srv/testnode/cum/inst/test0-0/parts/slapos.core/slapos/grid/promise/generic.py:171: ResourceWarning: unclosed file <_io.TextIOWrapper name='/tmp/tmpdal4xdoq/log/my_promise.log' mode='a' encoding='UTF-8'>
self._configureLogger()
ResourceWarning: Enable tracemalloc to get the object allocation traceback
ok
test_promise_resultfromlog_error (slapos.tests.test_promise.TestSlapOSGenericPromise) ... /srv/slapgrid/slappart7/srv/testnode/cum/inst/test0-0/parts/slapos.core/slapos/grid/promise/generic.py:171: ResourceWarning: unclosed file <_io.TextIOWrapper name='/tmp/tmp1rgwq1gc/log/my_promise.log' mode='a' encoding='UTF-8'>
self._configureLogger()
ResourceWarning: Enable tracemalloc to get the object allocation traceback
ok
test_promise_resultfromlog_latest_minutes (slapos.tests.test_promise.TestSlapOSGenericPromise) ... /srv/slapgrid/slappart7/srv/testnode/cum/inst/test0-0/parts/slapos.core/slapos/grid/promise/generic.py:171: ResourceWarning: unclosed file <_io.TextIOWrapper name='/tmp/tmplc60b9vs/log/my_promise.log' mode='a' encoding='UTF-8'>
self._configureLogger()
ResourceWarning: Enable tracemalloc to get the object allocation traceback
ok
test_promise_resultfromlog_latest_minutes_multilog (slapos.tests.test_promise.TestSlapOSGenericPromise) ... /srv/slapgrid/slappart7/srv/testnode/cum/inst/test0-0/parts/slapos.core/slapos/grid/promise/generic.py:171: ResourceWarning: unclosed file <_io.TextIOWrapper name='/tmp/tmpdg5fwqv4/log/my_promise.log' mode='a' encoding='UTF-8'>
self._configureLogger()
ResourceWarning: Enable tracemalloc to get the object allocation traceback
ok
test_promise_resultfromlog_no_logfolder (slapos.tests.test_promise.TestSlapOSGenericPromise) ... /srv/slapgrid/slappart7/srv/testnode/cum/inst/test0-0/parts/slapos.core/slapos/grid/promise/generic.py:171: ResourceWarning: unclosed file <_io.TextIOWrapper name='/tmp/tmp2otv0opz/log/my_promise.log' mode='a' encoding='UTF-8'>
self._configureLogger()
ResourceWarning: Enable tracemalloc to get the object allocation traceback
ok
test_promise_resultfromlog_result_count (slapos.tests.test_promise.TestSlapOSGenericPromise) ... ok
test_promise_resultfromlog_result_count_many (slapos.tests.test_promise.TestSlapOSGenericPromise) ... /srv/slapgrid/slappart7/srv/testnode/cum/inst/test0-0/parts/slapos.core/slapos/grid/promise/generic.py:171: ResourceWarning: unclosed file <_io.TextIOWrapper name='/tmp/tmpqr61voiu/log/my_promise.log' mode='a' encoding='UTF-8'>
self._configureLogger()
ResourceWarning: Enable tracemalloc to get the object allocation traceback
FAIL
test_promise_with_raise (slapos.tests.test_promise.TestSlapOSGenericPromise) ... /srv/slapgrid/slappart7/srv/testnode/cum/inst/test0-0/parts/slapos.core/slapos/grid/promise/generic.py:171: ResourceWarning: unclosed file <_io.TextIOWrapper name='/tmp/tmpmnpzjx07/log/my_promise.log' mode='a' encoding='UTF-8'>
self._configureLogger()
ResourceWarning: Enable tracemalloc to get the object allocation traceback
ok
test_promise_cache (slapos.tests.test_promise.TestSlapOSPromiseLauncher) ... /srv/slapgrid/slappart7/srv/testnode/cum/inst/test0-0/parts/slapos.core/slapos/grid/promise/generic.py:171: ResourceWarning: unclosed file <_io.TextIOWrapper name='/tmp/tmpzy75awhf/log/my_promise.log' mode='a' encoding='UTF-8'>
self._configureLogger()
ResourceWarning: Enable tracemalloc to get the object allocation traceback
ok
test_promise_cache_expire_with_periodicity (slapos.tests.test_promise.TestSlapOSPromiseLauncher) ... /srv/slapgrid/slappart7/srv/testnode/cum/inst/test0-0/parts/slapos.core/slapos/grid/promise/generic.py:171: ResourceWarning: unclosed file <_io.TextIOWrapper name='/tmp/tmpzy75awhf/log/my_promise.log' mode='a' encoding='UTF-8'>
self._configureLogger()
ResourceWarning: Enable tracemalloc to get the object allocation traceback
/srv/slapgrid/slappart7/srv/testnode/cum/inst/test0-0/parts/slapos.core/slapos/grid/promise/generic.py:171: ResourceWarning: unclosed file <_io.TextIOWrapper name='/tmp/tmpzy75awhf/log/my_promise.log' mode='a' encoding='UTF-8'>
self._configureLogger()
ResourceWarning: Enable tracemalloc to get the object allocation traceback
ok
test_promise_extra_config (slapos.tests.test_promise.TestSlapOSPromiseLauncher) ... ok
test_promise_extra_config_reserved_name (slapos.tests.test_promise.TestSlapOSPromiseLauncher) ... ok
test_promise_match_interface (slapos.tests.test_promise.TestSlapOSPromiseLauncher) ... ok
test_promise_match_interface_bad_name (slapos.tests.test_promise.TestSlapOSPromiseLauncher) ... ok
test_promise_match_interface_no_generic (slapos.tests.test_promise.TestSlapOSPromiseLauncher) ... ok
test_promise_match_interface_no_implement (slapos.tests.test_promise.TestSlapOSPromiseLauncher) ... ok
test_promise_match_interface_no_sense (slapos.tests.test_promise.TestSlapOSPromiseLauncher) ... ok
test_runpromise (slapos.tests.test_promise.TestSlapOSPromiseLauncher) ... /srv/slapgrid/slappart7/srv/testnode/cum/inst/test0-0/parts/slapos.core/slapos/grid/promise/generic.py:171: ResourceWarning: unclosed file <_io.TextIOWrapper name='/tmp/tmpzy75awhf/log/my_promise.log' mode='a' encoding='UTF-8'>
self._configureLogger()
ResourceWarning: Enable tracemalloc to get the object allocation traceback
ok
test_runpromise_fail_and_success (slapos.tests.test_promise.TestSlapOSPromiseLauncher) ... rm: cannot remove '/tmp/tmpc7rnj5i1/plugins/*.pyc': No such file or directory
ok
test_runpromise_fail_if_timeout_twice (slapos.tests.test_promise.TestSlapOSPromiseLauncher) ... ok
test_runpromise_force (slapos.tests.test_promise.TestSlapOSPromiseLauncher) ... ok
test_runpromise_multiple (slapos.tests.test_promise.TestSlapOSPromiseLauncher) ... /srv/slapgrid/slappart7/srv/testnode/cum/inst/test0-0/parts/slapos.core/slapos/grid/promise/generic.py:171: ResourceWarning: unclosed file <_io.TextIOWrapper name='/tmp/tmpzy75awhf/log/my_promise.log' mode='a' encoding='UTF-8'>
self._configureLogger()
ResourceWarning: Enable tracemalloc to get the object allocation traceback
ok
test_runpromise_multiple_times_same_promise (slapos.tests.test_promise.TestSlapOSPromiseLauncher) ... /srv/slapgrid/slappart7/srv/testnode/cum/inst/test0-0/parts/slapos.core/slapos/grid/promise/generic.py:171: ResourceWarning: unclosed file <_io.TextIOWrapper name='/tmp/tmpzy75awhf/log/my_promise.log' mode='a' encoding='UTF-8'>
self._configureLogger()
ResourceWarning: Enable tracemalloc to get the object allocation traceback
/srv/slapgrid/slappart7/srv/testnode/cum/inst/test0-0/parts/slapos.core/slapos/grid/promise/generic.py:171: ResourceWarning: unclosed file <_io.TextIOWrapper name='/tmp/tmpzy75awhf/log/my_promise.log' mode='a' encoding='UTF-8'>
self._configureLogger()
ResourceWarning: Enable tracemalloc to get the object allocation traceback
ok
test_runpromise_multiple_times_same_promise_with_failure (slapos.tests.test_promise.TestSlapOSPromiseLauncher) ... /srv/slapgrid/slappart7/srv/testnode/cum/inst/test0-0/parts/slapos.core/slapos/grid/promise/generic.py:171: ResourceWarning: unclosed file <_io.TextIOWrapper name='/tmp/tmpzy75awhf/log/my_promise.log' mode='a' encoding='UTF-8'>
self._configureLogger()
ResourceWarning: Enable tracemalloc to get the object allocation traceback
/srv/slapgrid/slappart7/srv/testnode/cum/inst/test0-0/parts/slapos.core/slapos/grid/promise/generic.py:171: ResourceWarning: unclosed file <_io.TextIOWrapper name='/tmp/tmpzy75awhf/log/my_promise.log' mode='a' encoding='UTF-8'>
self._configureLogger()
ResourceWarning: Enable tracemalloc to get the object allocation traceback
ok
test_runpromise_multiple_times_same_promise_with_flaky_failures (slapos.tests.test_promise.TestSlapOSPromiseLauncher) ... /srv/slapgrid/slappart7/srv/testnode/cum/inst/test0-0/parts/slapos.core/slapos/grid/promise/generic.py:171: ResourceWarning: unclosed file <_io.TextIOWrapper name='/tmp/tmpzy75awhf/log/my_promise.log' mode='a' encoding='UTF-8'>
self._configureLogger()
ResourceWarning: Enable tracemalloc to get the object allocation traceback
/srv/slapgrid/slappart7/srv/testnode/cum/inst/test0-0/parts/slapos.core/slapos/grid/promise/generic.py:171: ResourceWarning: unclosed file <_io.TextIOWrapper name='/tmp/tmpzy75awhf/log/my_promise.log' mode='a' encoding='UTF-8'>
self._configureLogger()
ResourceWarning: Enable tracemalloc to get the object allocation traceback
/srv/slapgrid/slappart7/srv/testnode/cum/inst/test0-0/parts/slapos.core/slapos/grid/promise/generic.py:171: ResourceWarning: unclosed file <_io.TextIOWrapper name='/tmp/tmpzy75awhf/log/my_promise.log' mode='a' encoding='UTF-8'>
self._configureLogger()
ResourceWarning: Enable tracemalloc to get the object allocation traceback
ok
test_runpromise_no_logdir (slapos.tests.test_promise.TestSlapOSPromiseLauncher) ... /srv/slapgrid/slappart7/srv/testnode/cum/inst/test0-0/parts/slapos.core/slapos/grid/promise/generic.py:171: ResourceWarning: unclosed file <_io.TextIOWrapper name='/tmp/tmpzy75awhf/log/my_promise.log' mode='a' encoding='UTF-8'>
self._configureLogger()
ResourceWarning: Enable tracemalloc to get the object allocation traceback
ok
test_runpromise_not_tested (slapos.tests.test_promise.TestSlapOSPromiseLauncher) ... /srv/slapgrid/slappart7/srv/testnode/cum/inst/test0-0/parts/slapos.core/slapos/grid/promise/generic.py:171: ResourceWarning: unclosed file <_io.TextIOWrapper name='/tmp/tmpzy75awhf/log/my_promise.log' mode='a' encoding='UTF-8'>
self._configureLogger()
ResourceWarning: Enable tracemalloc to get the object allocation traceback
ok
test_runpromise_not_tested_will_not_change_periodicity (slapos.tests.test_promise.TestSlapOSPromiseLauncher) ... /srv/slapgrid/slappart7/srv/testnode/cum/inst/test0-0/parts/slapos.core/slapos/grid/promise/generic.py:171: ResourceWarning: unclosed file <_io.TextIOWrapper name='/tmp/tmpzy75awhf/log/my_promise.log' mode='a' encoding='UTF-8'>
self._configureLogger()
ResourceWarning: Enable tracemalloc to get the object allocation traceback
/srv/slapgrid/slappart7/srv/testnode/cum/inst/test0-0/parts/slapos.core/slapos/grid/promise/generic.py:171: ResourceWarning: unclosed file <_io.TextIOWrapper name='/tmp/tmpzy75awhf/log/my_promise.log' mode='a' encoding='UTF-8'>
self._configureLogger()
ResourceWarning: Enable tracemalloc to get the object allocation traceback
ok
test_runpromise_not_tested_with_anomaly (slapos.tests.test_promise.TestSlapOSPromiseLauncher) ... /srv/slapgrid/slappart7/srv/testnode/cum/inst/test0-0/parts/slapos.core/slapos/grid/promise/generic.py:171: ResourceWarning: unclosed file <_io.TextIOWrapper name='/tmp/tmpzy75awhf/log/my_promise.log' mode='a' encoding='UTF-8'>
self._configureLogger()
ResourceWarning: Enable tracemalloc to get the object allocation traceback
ok
test_runpromise_not_tested_without_anomaly_fail (slapos.tests.test_promise.TestSlapOSPromiseLauncher) ... /srv/slapgrid/slappart7/srv/testnode/cum/inst/test0-0/parts/slapos.core/slapos/grid/promise/generic.py:171: ResourceWarning: unclosed file <_io.TextIOWrapper name='/tmp/tmpzy75awhf/log/my_promise.log' mode='a' encoding='UTF-8'>
self._configureLogger()
ResourceWarning: Enable tracemalloc to get the object allocation traceback
ok
test_runpromise_run_only (slapos.tests.test_promise.TestSlapOSPromiseLauncher) ... ok
test_runpromise_run_only_multiple (slapos.tests.test_promise.TestSlapOSPromiseLauncher) ... ok
test_runpromise_savemethod (slapos.tests.test_promise.TestSlapOSPromiseLauncher) ... /srv/slapgrid/slappart7/srv/testnode/cum/inst/test0-0/parts/slapos.core/slapos/grid/promise/generic.py:171: ResourceWarning: unclosed file <_io.TextIOWrapper name='/tmp/tmpzy75awhf/log/my_promise.log' mode='a' encoding='UTF-8'>
self._configureLogger()
ResourceWarning: Enable tracemalloc to get the object allocation traceback
ok
test_runpromise_savemethod_anomaly (slapos.tests.test_promise.TestSlapOSPromiseLauncher) ... /srv/slapgrid/slappart7/srv/testnode/cum/inst/test0-0/parts/slapos.core/slapos/grid/promise/generic.py:171: ResourceWarning: unclosed file <_io.TextIOWrapper name='/tmp/tmpzy75awhf/log/my_promise.log' mode='a' encoding='UTF-8'>
self._configureLogger()
ResourceWarning: Enable tracemalloc to get the object allocation traceback
ok
test_runpromise_savemethod_multiple (slapos.tests.test_promise.TestSlapOSPromiseLauncher) ... /srv/slapgrid/slappart7/srv/testnode/cum/inst/test0-0/parts/slapos.core/slapos/grid/promise/generic.py:171: ResourceWarning: unclosed file <_io.TextIOWrapper name='/tmp/tmpzy75awhf/log/my_promise.log' mode='a' encoding='UTF-8'>
self._configureLogger()
ResourceWarning: Enable tracemalloc to get the object allocation traceback
ok
test_runpromise_savemethod_multiple_success (slapos.tests.test_promise.TestSlapOSPromiseLauncher) ... ok
test_runpromise_savemethod_no_logdir (slapos.tests.test_promise.TestSlapOSPromiseLauncher) ... /srv/slapgrid/slappart7/srv/testnode/cum/inst/test0-0/parts/slapos.core/slapos/grid/promise/generic.py:171: ResourceWarning: unclosed file <_io.TextIOWrapper name='/tmp/tmpzy75awhf/log/my_promise.log' mode='a' encoding='UTF-8'>
self._configureLogger()
ResourceWarning: Enable tracemalloc to get the object allocation traceback
ok
test_runpromise_timeout_fail_if_test (slapos.tests.test_promise.TestSlapOSPromiseLauncher) ... ok
test_runpromise_will_timeout (slapos.tests.test_promise.TestSlapOSPromiseLauncher) ... ok
test_runpromise_with_periodicity (slapos.tests.test_promise.TestSlapOSPromiseLauncher) ... ok
test_runpromise_with_periodicity_result_failed (slapos.tests.test_promise.TestSlapOSPromiseLauncher) ... ok
test_runpromise_with_periodicity_result_failed_and_ok (slapos.tests.test_promise.TestSlapOSPromiseLauncher) ... rm: cannot remove '/tmp/tmpj_h4cjk2/plugins/*.pyc': No such file or directory
ok
test_runpromise_with_periodicity_same (slapos.tests.test_promise.TestSlapOSPromiseLauncher) ... ok
test_runpromise_without_anomaly (slapos.tests.test_promise.TestSlapOSPromiseLauncher) ... /srv/slapgrid/slappart7/srv/testnode/cum/inst/test0-0/parts/slapos.core/slapos/grid/promise/generic.py:171: ResourceWarning: unclosed file <_io.TextIOWrapper name='/tmp/tmpzy75awhf/log/my_promise.log' mode='a' encoding='UTF-8'>
self._configureLogger()
ResourceWarning: Enable tracemalloc to get the object allocation traceback
ok
test_runpromise_without_anomaly_but_test (slapos.tests.test_promise.TestSlapOSPromiseLauncher) ... /srv/slapgrid/slappart7/srv/testnode/cum/inst/test0-0/parts/slapos.core/slapos/grid/promise/generic.py:171: ResourceWarning: unclosed file <_io.TextIOWrapper name='/tmp/tmpzy75awhf/log/my_promise.log' mode='a' encoding='UTF-8'>
self._configureLogger()
ResourceWarning: Enable tracemalloc to get the object allocation traceback
ok
test_runpromise_without_anomaly_no_change_periodicity (slapos.tests.test_promise.TestSlapOSPromiseLauncher) ... /srv/slapgrid/slappart7/srv/testnode/cum/inst/test0-0/parts/slapos.core/slapos/grid/promise/generic.py:171: ResourceWarning: unclosed file <_io.TextIOWrapper name='/tmp/tmpzy75awhf/log/my_promise.log' mode='a' encoding='UTF-8'>
self._configureLogger()
ResourceWarning: Enable tracemalloc to get the object allocation traceback
/srv/slapgrid/slappart7/srv/testnode/cum/inst/test0-0/parts/slapos.core/slapos/grid/promise/generic.py:171: ResourceWarning: unclosed file <_io.TextIOWrapper name='/tmp/tmpzy75awhf/log/my_promise.log' mode='a' encoding='UTF-8'>
self._configureLogger()
ResourceWarning: Enable tracemalloc to get the object allocation traceback
ok
test_runpromise_wrapped (slapos.tests.test_promise.TestSlapOSPromiseLauncher) ... ok
test_runpromise_wrapped_failed (slapos.tests.test_promise.TestSlapOSPromiseLauncher) ... ok
test_runpromise_wrapped_mixed (slapos.tests.test_promise.TestSlapOSPromiseLauncher) ... ok
test_runpromise_wrapped_will_timeout (slapos.tests.test_promise.TestSlapOSPromiseLauncher) ... ok
test_runpromise_wrapped_will_timeout_two (slapos.tests.test_promise.TestSlapOSPromiseLauncher) ... ok
test_configure_local_environment (slapos.tests.test_configure_local.TestConfigureLocal) ... /srv/slapgrid/slappart7/srv/testnode/cum/soft/634492edcf7e7215bee7810c097cc1dc/eggs/setuptools-44.0.0-py3.7.egg/pkg_resources/__init__.py:1157: DeprecationWarning: Use of .. or absolute path in a resource path is not allowed and will raise exceptions in a future release.
/srv/slapgrid/slappart7/srv/testnode/cum/inst/test0-0/parts/slapos.core/slapos/cli/config.py:80: DeprecationWarning: The SafeConfigParser class has been renamed to ConfigParser in Python 3.2. This alias will be removed in future versions. Use ConfigParser directly instead.
configp = configparser.SafeConfigParser()
/srv/slapgrid/slappart7/srv/testnode/cum/inst/test0-0/parts/slapos.core/slapos/tests/test_configure_local.py:104: DeprecationWarning: This method will be removed in future versions. Use 'parser.read_file()' instead.
proxy_config.readfp(fout)
/srv/slapgrid/slappart7/srv/testnode/cum/inst/test0-0/parts/slapos.core/slapos/tests/test_configure_local.py:111: DeprecationWarning: This method will be removed in future versions. Use 'parser.read_file()' instead.
proxy_config.readfp(fout)
ok
test_configure_local_environment_with_default_value (slapos.tests.test_configure_local.TestConfigureLocal) ... /srv/slapgrid/slappart7/srv/testnode/cum/inst/test0-0/parts/slapos.core/slapos/tests/test_configure_local.py:75: DeprecationWarning: This method will be removed in future versions. Use 'parser.read_file()' instead.
proxy_config.readfp(fout)
/srv/slapgrid/slappart7/srv/testnode/cum/inst/test0-0/parts/slapos.core/slapos/tests/test_configure_local.py:82: DeprecationWarning: This method will be removed in future versions. Use 'parser.read_file()' instead.
proxy_config.readfp(fout)
ok
test_computer_getComputerPartitionList_empty_computer_guid (slapos.tests.test_slap.TestComputer)
Asserts that calling getComputerPartitionList with empty ... ok
test_computer_getComputerPartitionList_no_partition (slapos.tests.test_slap.TestComputer)
Asserts that calling Computer.getComputerPartitionList without Computer ... ok
test_computer_getComputerPartitionList_only_partition (slapos.tests.test_slap.TestComputer)
Asserts that calling Computer.getComputerPartitionList with only ... ok
test_computer_getSoftwareReleaseList_empty_computer_guid (slapos.tests.test_slap.TestComputer)
Asserts that calling getSoftwareReleaseList with empty ... ok
test_computer_reportUsage_non_valid_xml_raises (slapos.tests.test_slap.TestComputer)
Asserts that calling Computer.reportUsage with non DTD ... skipped 'Not implemented'
test_computer_reportUsage_valid_xml_invalid_partition_raises (slapos.tests.test_slap.TestComputer)
Asserts that calling Computer.reportUsage with DTD (not defined ... skipped 'Not implemented'
test_error_new_ComputerPartition_works (slapos.tests.test_slap.TestComputerPartition)
Asserts that calling ComputerPartition.error on new partition works ... ok
test_request_fullfilled_work (slapos.tests.test_slap.TestComputerPartition) ... ok
test_request_not_raises (slapos.tests.test_slap.TestComputerPartition) ... ok
test_request_raises_later (slapos.tests.test_slap.TestComputerPartition) ... ok
test_request_sends_request (slapos.tests.test_slap.TestComputerPartition) ... ok
test_request_with_slapgrid_request_transaction (slapos.tests.test_slap.TestComputerPartition) ... ok
test_setConnectionDict (slapos.tests.test_slap.TestComputerPartition) ... ok
test_setConnectionDict_optimised (slapos.tests.test_slap.TestComputerPartition) ... ok
test_setConnectionDict_optimised_tricky (slapos.tests.test_slap.TestComputerPartition) ... ok
test_setConnectionDict_slave (slapos.tests.test_slap.TestComputerPartition) ... ok
test_setConnectionDict_slave_expired_hash (slapos.tests.test_slap.TestComputerPartition) ... ok
test_setConnectionDict_slave_hash (slapos.tests.test_slap.TestComputerPartition) ... ok
test_setConnectionDict_slave_hash_tricky (slapos.tests.test_slap.TestComputerPartition) ... ok
test_setConnectionDict_update (slapos.tests.test_slap.TestComputerPartition) ... ok
test_started_new_ComputerPartition_raises (slapos.tests.test_slap.TestComputerPartition)
Asserts that calling ComputerPartition.started on new partition raises ... ok
test_stopped_new_ComputerPartition_raises (slapos.tests.test_slap.TestComputerPartition)
Asserts that calling ComputerPartition.stopped on new partition raises ... ok
test_getInformation (slapos.tests.test_slap.TestOpenOrder) ... ok
test_request_connection_dict_backward_compatibility (slapos.tests.test_slap.TestOpenOrder)
Backward compatibility API for slapproxy older them 1.0.1 ... ok
test_request_fullfilled_work (slapos.tests.test_slap.TestOpenOrder) ... ok
test_request_getConnectionParameter (slapos.tests.test_slap.TestOpenOrder)
Backward compatibility API for slapproxy older them 1.0.1 ... ok
test_request_not_raises (slapos.tests.test_slap.TestOpenOrder) ... skipped 'unclear what should be returned'
test_request_raises_later (slapos.tests.test_slap.TestOpenOrder) ... ok
test_request_sends_request (slapos.tests.test_slap.TestOpenOrder) ... ok
test_getFullComputerInformation_empty_computer_guid (slapos.tests.test_slap.TestSlap)
Asserts that calling getFullComputerInformation with empty computer_id ... ok
test_getSoftwareReleaseListFromSoftwareProduct_no_parameter (slapos.tests.test_slap.TestSlap)
Check that slap.getSoftwareReleaseListFromSoftwareProduct raises if ... ok
test_getSoftwareReleaseListFromSoftwareProduct_software_product_reference (slapos.tests.test_slap.TestSlap)
Check that slap.getSoftwareReleaseListFromSoftwareProduct calls ... ok
test_getSoftwareReleaseListFromSoftwareProduct_software_release_url (slapos.tests.test_slap.TestSlap)
Check that slap.getSoftwareReleaseListFromSoftwareProduct calls ... ok
test_getSoftwareReleaseListFromSoftwareProduct_too_many_parameters (slapos.tests.test_slap.TestSlap)
Check that slap.getSoftwareReleaseListFromSoftwareProduct raises if ... ok
test_initializeConnection_getHateoasUrl (slapos.tests.test_slap.TestSlap)
Test that by default, slap will try to fetch Hateoas URL from XML/RPC URL. ... ok
test_initializeConnection_noHateoasUrl (slapos.tests.test_slap.TestSlap)
Test that if no rest URL is specified and master does not know about rest, ... ok
test_initializeConnection_specifiedHateoasUrl (slapos.tests.test_slap.TestSlap)
Test that if rest URL is specified, slap will NOT try to fetch ... ok
test_registerComputerPartition_empty_computer_guid (slapos.tests.test_slap.TestSlap)
Asserts that calling registerComputerPartition with empty computer_id ... ok
test_registerComputerPartition_empty_computer_guid_empty_computer_partition_id (slapos.tests.test_slap.TestSlap)
Asserts that calling registerComputerPartition with empty ... ok
test_registerComputerPartition_empty_computer_partition_id (slapos.tests.test_slap.TestSlap)
Asserts that calling registerComputerPartition with empty ... ok
test_registerComputerPartition_existing_partition_id_known_computer_guid (slapos.tests.test_slap.TestSlap)
Asserts that calling slap.registerComputerPartition on known computer ... ok
test_registerComputerPartition_new_partition_id_known_computer_guid (slapos.tests.test_slap.TestSlap)
Asserts that calling slap.registerComputerPartition on known computer ... ok
test_registerComputerPartition_unknown_computer_guid (slapos.tests.test_slap.TestSlap)
Asserts that calling slap.registerComputerPartition on unknown ... ok
test_registerComputer_with_existing_guid (slapos.tests.test_slap.TestSlap)
Asserts that calling slap.registerComputer with already used guid ... ok
test_registerComputer_with_new_guid (slapos.tests.test_slap.TestSlap)
Asserts that calling slap.registerComputer with new guid returns ... ok
test_registerSoftwareRelease_with_existing_uri (slapos.tests.test_slap.TestSlap)
Asserts that calling slap.registerSoftwareRelease with already ... ok
test_registerSoftwareRelease_with_new_uri (slapos.tests.test_slap.TestSlap)
Asserts that calling slap.registerSoftwareRelease with new guid ... ok
test_slap_initialisation (slapos.tests.test_slap.TestSlap)
Asserts that slap initialisation works properly in case of ... ok
test_slap_initialisation_hostname (slapos.tests.test_slap.TestSlap) ... /srv/slapgrid/slappart7/srv/testnode/cum/shared/python3/3c76e4d5caeddddc982d72375e043ecc/lib/python3.7/unittest/case.py:628: ResourceWarning: unclosed <socket.socket fd=60, family=AddressFamily.AF_INET6, type=SocketKind.SOCK_STREAM, proto=6, laddr=('2001:67c:1254:44:b176::cf51', 34280, 0, 0), raddr=('2606:2800:220:1:248:1893:25c8:1946', 80, 0, 0)>
testMethod()
ResourceWarning: Enable tracemalloc to get the object allocation traceback
ok
test_slap_initialisation_ipv4 (slapos.tests.test_slap.TestSlap) ... ok
test_slap_initialisation_ipv6_and_port (slapos.tests.test_slap.TestSlap) ... ok
test_slap_initialisation_ipv6_with_bracket (slapos.tests.test_slap.TestSlap) ... ok
test_slap_initialisation_ipv6_without_port (slapos.tests.test_slap.TestSlap) ... ok
test_get_product (slapos.tests.test_slap.TestSoftwareProductCollection)
Test that the get method (aliased to __getattr__) returns the first element ... ok
test_get_product_empty_product (slapos.tests.test_slap.TestSoftwareProductCollection)
Test that the get method (aliased to __getattr__) raises if no ... ok
test_get_product_getattr (slapos.tests.test_slap.TestSoftwareProductCollection)
Test that __getattr__ method is bound to get() method. ... ok
test_available_new_SoftwareRelease_raises (slapos.tests.test_slap.TestSoftwareRelease)
Asserts that calling SoftwareRelease.available on new software release ... ok
test_building_new_SoftwareRelease_raises (slapos.tests.test_slap.TestSoftwareRelease)
Asserts that calling SoftwareRelease.building on new software release ... ok
test_error_new_SoftwareRelease_works (slapos.tests.test_slap.TestSoftwareRelease)
Asserts that calling SoftwareRelease.error on software release works ... ok
test_chown_directory (slapos.tests.test_util.TestUtil)
Test that slapos.util.chownDirectory correctly changes owner. ... skipped 'No root privileges, impossible to chown.'
test_dict2xml0 (slapos.tests.test_util.TestUtil) ... ok
test_dict2xml1 (slapos.tests.test_util.TestUtil) ... ok
test_dumps_loads (slapos.tests.test_util.TestUtil) ... ok
test_mkdir_already_existing (slapos.tests.test_util.TestUtil)
Check that mkdir_p doesn't raise if directory already exist. ... ok
test_mkdir_p_new_directory (slapos.tests.test_util.TestUtil)
Test that mkdir_p recursively creates a directory. ... ok
test_string_to_boolean_with_false_values (slapos.tests.test_util.TestUtil) ... ok
test_string_to_boolean_with_incorrect_values (slapos.tests.test_util.TestUtil) ... ok
test_string_to_boolean_with_true_values (slapos.tests.test_util.TestUtil) ... ok
test_xml2dict0 (slapos.tests.test_util.TestUtil) ... ok
test_xml2dict1 (slapos.tests.test_util.TestUtil) ... ok
test_node_boot (slapos.tests.test_cli.TestCliBoot) ... ok
test_bad_cache_dir (slapos.tests.test_cli.TestCliCache) ... /srv/slapgrid/slappart7/srv/testnode/cum/inst/test0-0/parts/slapos.core/slapos/tests/test_cli.py:104: DeprecationWarning: Please use assertEqual instead.
software_url=self.test_url))
ok
test_cached_binary (slapos.tests.test_cli.TestCliCache) ... /srv/slapgrid/slappart7/srv/testnode/cum/inst/test0-0/parts/slapos.core/slapos/grid/distribution.py:80: DeprecationWarning: 'U' mode is deprecated
etclsbrel = open("/etc/lsb-release", "rU")
/srv/slapgrid/slappart7/srv/testnode/cum/inst/test0-0/parts/slapos.core/slapos/grid/distribution.py:96: DeprecationWarning: dist() and linux_distribution() functions are deprecated in Python 3.5
return platform.linux_distribution(distname, version, id, supported_dists, full_distribution_name)
ok
test_uncached_binary (slapos.tests.test_cli.TestCliCache) ... ok
test_bad_cache_dir (slapos.tests.test_cli.TestCliCacheSource) ... ok
test_cached_source (slapos.tests.test_cli.TestCliCacheSource) ... ok
test_uncached_binary (slapos.tests.test_cli.TestCliCacheSource) ... /srv/slapgrid/slappart7/srv/testnode/cum/shared/python3/3c76e4d5caeddddc982d72375e043ecc/lib/python3.7/subprocess.py:883: ResourceWarning: subprocess 15710 is still running
ResourceWarning, source=self)
ResourceWarning: Enable tracemalloc to get the object allocation traceback
/srv/slapgrid/slappart7/srv/testnode/cum/shared/python3/3c76e4d5caeddddc982d72375e043ecc/lib/python3.7/subprocess.py:883: ResourceWarning: subprocess 16358 is still running
ResourceWarning, source=self)
ResourceWarning: Enable tracemalloc to get the object allocation traceback
ok
test_computer_emptyList (slapos.tests.test_cli.TestCliComputerList) ... ok
test_computer_list (slapos.tests.test_cli.TestCliComputerList)
Test "slapos computer list" command output. ... ok
test_console_interactive (slapos.tests.test_cli.TestCliConsole) ...
now exiting InteractiveConsole...
ok
test_console_script (slapos.tests.test_cli.TestCliConsole) ... ok
test_info (slapos.tests.test_cli.TestCliInfo)
Test "slapos service info" command output. ... ok
test_unknownReference (slapos.tests.test_cli.TestCliInfo)
Test "slapos service info" command output in case reference ... ok
test_emptyList (slapos.tests.test_cli.TestCliList) ... ok
test_list (slapos.tests.test_cli.TestCliList)
Test "slapos service list" command output. ... ok
test_node_instance (slapos.tests.test_cli.TestCliNode)
slapos node instance command ... ok
test_node_software (slapos.tests.test_cli.TestCliNode)
slapos node software command ... /srv/slapgrid/slappart7/srv/testnode/cum/soft/634492edcf7e7215bee7810c097cc1dc/eggs/mock-2.0.0-py3.7.egg/mock/mock.py:2027: ResourceWarning: unclosed <socket.socket fd=5, family=AddressFamily.AF_INET6, type=SocketKind.SOCK_STREAM, proto=6, laddr=('2001:67c:1254:44:b176::cf51', 48908, 0, 0), raddr=('2001:67c:1254:27::4ac1', 443, 0, 0)>
self.name = name
ResourceWarning: Enable tracemalloc to get the object allocation traceback
ok
test_generateSoftwareProductListFromString (slapos.tests.test_cli.TestCliProxy)
Test that generateSoftwareProductListFromString correctly parses a parameter ... ok
test_generateSoftwareProductListFromString_emptyString (slapos.tests.test_cli.TestCliProxy) ... ok
test_proxy_show (slapos.tests.test_cli.TestCliProxyShow) ... /srv/slapgrid/slappart7/srv/testnode/cum/soft/634492edcf7e7215bee7810c097cc1dc/eggs/mock-2.0.0-py3.7.egg/mock/mock.py:1047: ResourceWarning: unclosed <socket.socket fd=5, family=AddressFamily.AF_INET6, type=SocketKind.SOCK_STREAM, proto=6, laddr=('2001:67c:1254:44:b176::cf51', 48912, 0, 0), raddr=('2001:67c:1254:27::4ac1', 443, 0, 0)>
_spec_state, _new_name, _new_parent, **kwargs
ResourceWarning: Enable tracemalloc to get the object allocation traceback
ok
test_proxy_show_displays_on_stdout (slapos.tests.test_cli.TestCliProxyShow) ... ok
test_proxy_show_use_pager (slapos.tests.test_cli.TestCliProxyShow) ... ok
test_allow_supervisord_launch (slapos.tests.test_cli.TestCliSupervisorctl)
Test that "slapos node supervisorctl" tries to launch supervisord ... ok
test_forbid_supervisord_launch (slapos.tests.test_cli.TestCliSupervisorctl)
Test that "slapos node supervisorctl" does not try to launch supervisord ... ok
test_computer_info (slapos.tests.test_cli.TestComputerCliInfo)
Test "slapos computer info" command output. ... ok
test_computer_unknownReference (slapos.tests.test_cli.TestComputerCliInfo)
Test "slapos computer info" command output in case reference ... ok
test_computer_token (slapos.tests.test_cli.TestComputerCliToken)
Test "slapos computer token" command output. ... ok
test_fetch_configuration (slapos.tests.test_register.TestRegister)
Simple test to Fetch the configuration template ... ok
test_getSoftwareReleaseFromSoftwareString_softwareProduct (slapos.tests.test_client.TestClient)
Test that if given software is a Sofwtare Product (i.e matching ... ok
test_getSoftwareReleaseFromSoftwareString_softwareProduct_emptySoftwareProduct (slapos.tests.test_client.TestClient)
Test that if given software is a Software Product (i.e matching ... ok
test_getSoftwareReleaseFromSoftwareString_softwareRelease (slapos.tests.test_client.TestClient)
Test that if given software is a simple Software Release URL (not matching ... ok
test_request_instance (slapos.tests.test_standalone.TestSlapOSStandaloneInstance) ... ok
test_format (slapos.tests.test_standalone.TestSlapOSStandaloneSetup) ... ok
test_partition_forward (slapos.tests.test_standalone.TestSlapOSStandaloneSetup) ... ok
test_reformat_different_base_name (slapos.tests.test_standalone.TestSlapOSStandaloneSetup) ... ok
test_reformat_less_chmod_files (slapos.tests.test_standalone.TestSlapOSStandaloneSetup) ... ok
test_reformat_less_partitions (slapos.tests.test_standalone.TestSlapOSStandaloneSetup) ... ok
test_reformat_refuse_deleting_running_partition (slapos.tests.test_standalone.TestSlapOSStandaloneSetup) ... ok
test_two_instance_from_same_directory (slapos.tests.test_standalone.TestSlapOSStandaloneSetup) ... ok
test_install_software (slapos.tests.test_standalone.TestSlapOSStandaloneSoftware) ... ok
test_install_software_failure (slapos.tests.test_standalone.TestSlapOSStandaloneSoftware) ... ok
test_dry_run (slapos.tests.test_prune.TestPrune) ... ok
test_recursive_instance_broken_slapos_cfg (slapos.tests.test_prune.TestPrune) ... ok
test_shared_part_not_used_recursive_dependencies (slapos.tests.test_prune.TestPrune) ... ok
test_shared_part_used_in_another_shared_part (slapos.tests.test_prune.TestPrune) ... ok
test_shared_part_used_in_buildout_script (slapos.tests.test_prune.TestPrune) ... ok
test_shared_part_used_in_recursive_instance (slapos.tests.test_prune.TestPrune) ... ok
test_simple_not_used_share_part (slapos.tests.test_prune.TestPrune) ... ok

======================================================================
FAIL: test_promise_resultfromlog_result_count_many (slapos.tests.test_promise.TestSlapOSGenericPromise)
----------------------------------------------------------------------
Traceback (most recent call last):
File "/srv/slapgrid/slappart7/srv/testnode/cum/inst/test0-0/parts/slapos.core/slapos/tests/test_promise.py", line 1945, in test_promise_resultfromlog_result_count_many
self.assertEqual(len(latest_message_list), 25)
AssertionError: 24 != 25

----------------------------------------------------------------------
Ran 683 tests in 1268.414s

FAILED (failures=1, skipped=31)
Test failed: <unittest.runner.TextTestResult run=683 errors=0 failures=1>
error: Test failed: <unittest.runner.TextTestResult run=683 errors=0 failures=1>