VIFIB DESCENTRALIZED CLOUD COMPUTING

SlapOS is a decentralized Cloud Computing technology that can automate the deployment and configuration of applications in a heterogeneous environment.
kedifa
69.275
76
0
1
1
FAILED
Completed
SLAPOS_TEST_SHARED_PART_LIST= /srv/slapgrid/slappart9/srv/testnode/bvi/soft/65dbbd3d11daa99cf78c9566a0a4798e/bin/python_for_test setup.py test
Warning: build in /srv/slapgrid/slappart9/srv/testnode/bvi/soft/65dbbd3d11daa99cf78c9566a0a4798e/parts/kedifa-repository is using versioneer.py from /srv/slapgrid/slappart9/srv/testnode/bvi/inst/test0-0/parts/kedifa/versioneer.py
running test
running egg_info
creating kedifa.egg-info
writing requirements to kedifa.egg-info/requires.txt
writing kedifa.egg-info/PKG-INFO
writing top-level names to kedifa.egg-info/top_level.txt
writing dependency_links to kedifa.egg-info/dependency_links.txt
writing entry points to kedifa.egg-info/entry_points.txt
writing manifest file 'kedifa.egg-info/SOURCES.txt'
reading manifest file 'kedifa.egg-info/SOURCES.txt'
reading manifest template 'MANIFEST.in'
writing manifest file 'kedifa.egg-info/SOURCES.txt'
running build_ext
5587626096574780220 was (originally) automatically approved
5725218257134575619 was (originally) automatically approved
7422245791397263039 was (originally) automatically approved
8967706125893955089 was (originally) automatically approved
4919255721659692189 was (originally) automatically approved
5204891536973294825 was (originally) automatically approved
7312560419139268156 was (originally) automatically approved
8076132789262038254 was (originally) automatically approved
1264818788268135712 was (originally) automatically approved
4853570228859074206 was (originally) automatically approved
u'https://[2001:67c:1254:e:7b::73ab]:50873/bnfcgweprimvwxkytxqkypcuwk0sscmqMISSING' not downloaded, HTTP code 404
9106152049639939069 was (originally) automatically approved
8246555377890936867 was (originally) automatically approved
7459177567858416630 was (originally) automatically approved
1179404089942743662 was (originally) automatically approved
Certificate '/tmp/tmpzqMqxD/tmpdfT9eo': updated from 'https://[2001:67c:1254:e:7b::73ab]:51407/5dkae1exi1lfq5fyh3y0csz565nuoleb'
7560491279298637354 was (originally) automatically approved
8366528912214271421 was (originally) automatically approved
Certificate '/tmp/tmpp71cFL/tmpLL14p1': 'https://[2001:67c:1254:e:7b::73ab]:54923/5zhqdyczn4sce4h68fj3wzvcopifd7fuMISSING' not downloaded, HTTP code 404
4846394448164625673 was (originally) automatically approved
7098216453395172717 was (originally) automatically approved
5933482927090836425 was (originally) automatically approved
3774572367984723671 was (originally) automatically approved
842843399409532780 was (originally) automatically approved
4361771544572613722 was (originally) automatically approved
5298585705625880332 was (originally) automatically approved
1748570375814313044 was (originally) automatically approved
u'https://[2001:67c:1254:e:7b::73ab]:54061/v5iw5033tb84d2mvzd4ixn863vb686r7' not downloaded, problem (104, 'ECONNRESET')
2993966620560449056 was (originally) automatically approved
4023648272501687857 was (originally) automatically approved
3519083459445264658 was (originally) automatically approved
6911349878703608571 was (originally) automatically approved
6385218159418527218 was (originally) automatically approved
5254928643665789146 was (originally) automatically approved
2454129985850360456 was (originally) automatically approved
8377682685046844607 was (originally) automatically approved
1759046480548093734 was (originally) automatically approved
6723640280720456598 was (originally) automatically approved
4205465023914369501 was (originally) automatically approved
1981999529061405595 was (originally) automatically approved
5621947185935825453 was (originally) automatically approved
2588866710279550495 was (originally) automatically approved
7855633131010279170 was (originally) automatically approved
7608952255740031545 was (originally) automatically approved
3275942468104346230 was (originally) automatically approved
7432247221639205889 was (originally) automatically approved
1049353512270431917 was (originally) automatically approved
3395367828370033992 was (originally) automatically approved
5824534503727136496 was (originally) automatically approved
209745445012000227 was (originally) automatically approved
8835708726823429929 was (originally) automatically approved
4413156312563311269 was (originally) automatically approved
6381047788782565820 was (originally) automatically approved
3879170149585824877 was (originally) automatically approved
Certificate '/tmp/tmpiSyRt8/tmp3iUZwv': problem with 'https://[2001:67c:1254:e:7b::73ab]:50759/5az7ph983nhdohwihsbasr9hyj5jn89z' not downloaded: (104, 'ECONNRESET')
493003183164728678 was (originally) automatically approved
3817352431173045702 was (originally) automatically approved
5803890156976051114 was (originally) automatically approved
6454645881596362450 was (originally) automatically approved
4418498076125921621 was (originally) automatically approved
2448767602468857701 was (originally) automatically approved
6645053475278315439 was (originally) automatically approved
5584875989863493423 was (originally) automatically approved
6869983231541677883 was (originally) automatically approved
949054802034307624 was (originally) automatically approved
6814695195135303413 was (originally) automatically approved
1191957115604715755 was (originally) automatically approved
8510005693307979022 was (originally) automatically approved
1717840076004617177 was (originally) automatically approved
5011708844793824929 was (originally) automatically approved
834545837338775867 was (originally) automatically approved
2527996833609917571 was (originally) automatically approved
564037209161320782 was (originally) automatically approved
4779229406279128598 was (originally) automatically approved
500708598714298913 was (originally) automatically approved
5220833156707328493 was (originally) automatically approved
3533351496525515867 was (originally) automatically approved
7952251171566391763 was (originally) automatically approved
2840556829198093629 was (originally) automatically approved
258623125415287680 was (originally) automatically approved
5337658352966579230 was (originally) automatically approved
7805453745019951299 was (originally) automatically approved
140337570595937412 was (originally) automatically approved
Sleeping for 1s
Couldn't lock '/tmp/tmppfGUme/tmp6CSFbi.lock'
...exiting.
Line 'buzz' is incorrect
Prepare: Used '/tmp/tmpIiUOpi/tmpIy7STM' for '/tmp/tmpIiUOpi/tmpxcQmh_'
Prepare: Used '/tmp/tmpsF2uOK/tmpna2Su3' for '/tmp/tmpsF2uOK/tmp7bxDR1'
Prepare: Used '/tmp/tmphVXKnR/tmplSuCBI' for '/tmp/tmphVXKnR/tmpnmH7Mf'
Certificate '/tmp/tmpIl9gjl/tmpIH7mHa': updated from 'http://example.com'
Certificate '/tmp/tmp4cYGVf/tmpJvMDic': updated from 'http://example.com'
Certificate '/tmp/tmpWmKzDU/tmplupXyc': updated from 'http://example.com'
Certificate '/tmp/tmpVV8ETW/tmppUh3LI': updated from 'http://example.com'
Certificate '/tmp/tmplq_TkE/tmpJjzrmM': updated from 'http://example.com'
Certificate '/tmp/tmpYNZHCe/tmpvgX6Ht': updated from 'http://example.com'
Certificate '/tmp/tmpbQ7Fs1/tmpgenLjN': updated from 'http://example.com'
Certificate '/tmp/tmp96UhCl/tmpPxq_yr': updated from 'http://example.com'
Certificate '/tmp/tmpWyPmHT/tmpbWodHa': updated from 'http://example.com'
Certificate '/tmp/tmpPMYZ88/tmpm6CkY3': updated from 'http://example.com'
Certificate '/tmp/tmpct6mHr/tmpgEcvNf': updated from 'http://example.com'
Certificate '/tmp/tmpjsRKxD/tmpQ7fLQg': updated from '/master/certificate/file'
Certificate '/tmp/tmpjiD51g/tmpEdhLlx': updated from 'http://example.com'
test_GET_cleanCertificate (kedifa.test.KedifaIntegrationTest) ... Listening on [2001:67c:1254:e:7b::73ab]:41943-41944
ok
test_GET_existing (kedifa.test.KedifaIntegrationTest) ... Listening on [2001:67c:1254:e:7b::73ab]:40077-40078
ok
test_GET_existing_exact (kedifa.test.KedifaIntegrationTest) ... Listening on [2001:67c:1254:e:7b::73ab]:51559-51560
ok
test_GET_existing_getter (kedifa.test.KedifaIntegrationTest) ... Listening on [2001:67c:1254:e:7b::73ab]:58675-58676
ok
test_GET_existing_getter_name_does_not_match (kedifa.test.KedifaIntegrationTest) ... Listening on [2001:67c:1254:e:7b::73ab]:56245-56246
ok
test_GET_existing_no_identity (kedifa.test.KedifaIntegrationTest) ... Listening on [2001:67c:1254:e:7b::73ab]:39159-39160
ok
test_GET_existing_updater (kedifa.test.KedifaIntegrationTest) ... Listening on [2001:67c:1254:e:7b::73ab]:49403-49404
ok
test_GET_existing_updater_name_does_not_match (kedifa.test.KedifaIntegrationTest) ... Listening on [2001:67c:1254:e:7b::73ab]:42877-42878
ok
test_GET_expired (kedifa.test.KedifaIntegrationTest) ... Listening on [2001:67c:1254:e:7b::73ab]:37487-37488
ok
test_GET_expired_identity (kedifa.test.KedifaIntegrationTest) ... skipped 'Hard to implement, and already being partially covered by test_GET_revoked_identity'
test_GET_generateauth (kedifa.test.KedifaIntegrationTest) ... Listening on [2001:67c:1254:e:7b::73ab]:50361-50362
ok
test_GET_generateauth_no_reserved (kedifa.test.KedifaIntegrationTest) ... Listening on [2001:67c:1254:e:7b::73ab]:58613-58614
ok
test_GET_getter_unsigned_identity (kedifa.test.KedifaIntegrationTest) ... Listening on [2001:67c:1254:e:7b::73ab]:37443-37444
ok
test_GET_invalid_yet (kedifa.test.KedifaIntegrationTest) ... Listening on [2001:67c:1254:e:7b::73ab]:34161-34162
ok
test_GET_list (kedifa.test.KedifaIntegrationTest) ... Listening on [2001:67c:1254:e:7b::73ab]:55429-55430
ok
test_GET_list_cleanCertificate (kedifa.test.KedifaIntegrationTest) ... Listening on [2001:67c:1254:e:7b::73ab]:49989-49990
ok
test_GET_list_empty (kedifa.test.KedifaIntegrationTest) ... Listening on [2001:67c:1254:e:7b::73ab]:38409-38410
ok
test_GET_list_no_identity (kedifa.test.KedifaIntegrationTest) ... Listening on [2001:67c:1254:e:7b::73ab]:42409-42410
ok
test_GET_new_server_ca (kedifa.test.KedifaIntegrationTest) ... Listening on [2001:67c:1254:e:7b::73ab]:58277-58278
Listening on [2001:67c:1254:e:7b::73ab]:44417-44418
ok
test_GET_not_existing (kedifa.test.KedifaIntegrationTest) ... Listening on [2001:67c:1254:e:7b::73ab]:52701-52702
ok
test_GET_order (kedifa.test.KedifaIntegrationTest) ... Listening on [2001:67c:1254:e:7b::73ab]:38307-38308
ok
test_GET_revoked_identity (kedifa.test.KedifaIntegrationTest) ... Listening on [2001:67c:1254:e:7b::73ab]:47175-47176
ok
test_GET_root (kedifa.test.KedifaIntegrationTest) ... Listening on [2001:67c:1254:e:7b::73ab]:56783-56784
ok
test_GET_unsigned_identity (kedifa.test.KedifaIntegrationTest) ... Listening on [2001:67c:1254:e:7b::73ab]:52991-52992
ERROR
test_GET_updater_unsigned_identity (kedifa.test.KedifaIntegrationTest) ... Listening on [2001:67c:1254:e:7b::73ab]:51063-51064
ok
test_PUT (kedifa.test.KedifaIntegrationTest) ... Listening on [2001:67c:1254:e:7b::73ab]:37711-37712
ok
test_PUT_bad (kedifa.test.KedifaIntegrationTest) ... Listening on [2001:67c:1254:e:7b::73ab]:48013-48014
ok
test_PUT_bad_auth (kedifa.test.KedifaIntegrationTest) ... Listening on [2001:67c:1254:e:7b::73ab]:50863-50864
ok
test_PUT_certificate_expired (kedifa.test.KedifaIntegrationTest) ... Listening on [2001:67c:1254:e:7b::73ab]:56377-56378
ok
test_PUT_certificate_key_mismatch (kedifa.test.KedifaIntegrationTest) ... Listening on [2001:67c:1254:e:7b::73ab]:37925-37926
ok
test_PUT_certificate_not_valid_yet (kedifa.test.KedifaIntegrationTest) ... Listening on [2001:67c:1254:e:7b::73ab]:34939-34940
ok
test_PUT_certificate_only (kedifa.test.KedifaIntegrationTest) ... Listening on [2001:67c:1254:e:7b::73ab]:37525-37526
ok
test_PUT_key_before_certificate (kedifa.test.KedifaIntegrationTest) ... Listening on [2001:67c:1254:e:7b::73ab]:56555-56556
ok
test_PUT_key_only (kedifa.test.KedifaIntegrationTest) ... Listening on [2001:67c:1254:e:7b::73ab]:32973-32974
ok
test_PUT_multiple_different_reference (kedifa.test.KedifaIntegrationTest) ... Listening on [2001:67c:1254:e:7b::73ab]:35713-35714
ok
test_PUT_multiple_same_reference (kedifa.test.KedifaIntegrationTest) ... Listening on [2001:67c:1254:e:7b::73ab]:50037-50038
ok
test_PUT_no_auth (kedifa.test.KedifaIntegrationTest) ... Listening on [2001:67c:1254:e:7b::73ab]:48561-48562
ok
test_bad_query_string (kedifa.test.KedifaIntegrationTest) ... Listening on [2001:67c:1254:e:7b::73ab]:35967-35968
ok
test_reload_log (kedifa.test.KedifaIntegrationTest) ... Listening on [2001:67c:1254:e:7b::73ab]:58573-58574
ok
test (kedifa.test.KedifaUpdaterLoopTest) ... ok
test_infinite (kedifa.test.KedifaUpdaterLoopTest) ... ok
test_lock (kedifa.test.KedifaUpdaterLoopTest) ... ok
test_raises (kedifa.test.KedifaUpdaterLoopTest) ... ok
test_updateMapping_empty (kedifa.test.KedifaUpdaterMappingTest) ... ok
test_updateMapping_morewhite (kedifa.test.KedifaUpdaterMappingTest) ... ok
test_updateMapping_normal (kedifa.test.KedifaUpdaterMappingTest) ... ok
test_updateMapping_one_comment (kedifa.test.KedifaUpdaterMappingTest) ... ok
test_updateMapping_one_empty (kedifa.test.KedifaUpdaterMappingTest) ... ok
test_updateMapping_one_not_enough (kedifa.test.KedifaUpdaterMappingTest) ... ok
test_updateMapping_with_fallback (kedifa.test.KedifaUpdaterMappingTest) ... ok
test_cert_master_fallback (kedifa.test.KedifaUpdaterUpdateCertificatePrepareTest) ... ok
test_cert_master_nofallback (kedifa.test.KedifaUpdaterUpdateCertificatePrepareTest) ... ok
test_cert_nomaster_fallback (kedifa.test.KedifaUpdaterUpdateCertificatePrepareTest) ... ok
test_cert_nomaster_nofallback (kedifa.test.KedifaUpdaterUpdateCertificatePrepareTest) ... ok
test_nocert_master_fallback (kedifa.test.KedifaUpdaterUpdateCertificatePrepareTest) ... ok
test_nocert_master_nofallback (kedifa.test.KedifaUpdaterUpdateCertificatePrepareTest) ... ok
test_nocert_nomaster_fallback (kedifa.test.KedifaUpdaterUpdateCertificatePrepareTest) ... ok
test_nocert_nomaster_nofallback (kedifa.test.KedifaUpdaterUpdateCertificatePrepareTest) ... ok
test_cert_fetch_master_fallback (kedifa.test.KedifaUpdaterUpdateCertificateTest) ... ok
test_cert_fetch_master_nofallback (kedifa.test.KedifaUpdaterUpdateCertificateTest) ... ok
test_cert_fetch_nomaster_fallback (kedifa.test.KedifaUpdaterUpdateCertificateTest) ... ok
test_cert_fetch_nomaster_nofallback (kedifa.test.KedifaUpdaterUpdateCertificateTest) ... ok
test_cert_nofetch_master_fallback (kedifa.test.KedifaUpdaterUpdateCertificateTest) ... ok
test_cert_nofetch_master_fallback_overridden (kedifa.test.KedifaUpdaterUpdateCertificateTest) ... ok
test_cert_nofetch_master_nofallback (kedifa.test.KedifaUpdaterUpdateCertificateTest) ... ok
test_cert_nofetch_nomaster_fallback (kedifa.test.KedifaUpdaterUpdateCertificateTest) ... ok
test_cert_nofetch_nomaster_fallback_overridden (kedifa.test.KedifaUpdaterUpdateCertificateTest) ... ok
test_cert_nofetch_nomaster_nofallback (kedifa.test.KedifaUpdaterUpdateCertificateTest) ... ok
test_nocert_fetch_master_fallback (kedifa.test.KedifaUpdaterUpdateCertificateTest) ... ok
test_nocert_fetch_master_nofallback (kedifa.test.KedifaUpdaterUpdateCertificateTest) ... ok
test_nocert_fetch_nomaster_fallback (kedifa.test.KedifaUpdaterUpdateCertificateTest) ... ok
test_nocert_fetch_nomaster_nofallback (kedifa.test.KedifaUpdaterUpdateCertificateTest) ... ok
test_nocert_nofetch_master_fallback (kedifa.test.KedifaUpdaterUpdateCertificateTest) ... ok
test_nocert_nofetch_master_nofallback (kedifa.test.KedifaUpdaterUpdateCertificateTest) ... ok
test_nocert_nofetch_nomaster_fallback (kedifa.test.KedifaUpdaterUpdateCertificateTest) ... ok
test_nocert_nofetch_nomaster_nofallback (kedifa.test.KedifaUpdaterUpdateCertificateTest) ... ok

======================================================================
ERROR: test_GET_unsigned_identity (kedifa.test.KedifaIntegrationTest)
----------------------------------------------------------------------
Traceback (most recent call last):
File "/srv/slapgrid/slappart9/srv/testnode/bvi/inst/test0-0/parts/kedifa/kedifa/test.py", line 431, in test_GET_unsigned_identity
self.kedifa_url + self.reference, cert=incorrect_key_pem)
File "/srv/slapgrid/slappart9/srv/testnode/bvi/inst/test0-0/parts/kedifa/kedifa/test.py", line 303, in requests_get
return requests.get(verify=self.ca_crt_pem, *args, **kwargs)
File "/srv/slapgrid/slappart9/srv/testnode/bvi/soft/65dbbd3d11daa99cf78c9566a0a4798e/eggs/requests-2.13.0-py2.7.egg/requests/api.py", line 70, in get
return request('get', url, params=params, **kwargs)
File "/srv/slapgrid/slappart9/srv/testnode/bvi/soft/65dbbd3d11daa99cf78c9566a0a4798e/eggs/requests-2.13.0-py2.7.egg/requests/api.py", line 56, in request
return session.request(method=method, url=url, **kwargs)
File "/srv/slapgrid/slappart9/srv/testnode/bvi/soft/65dbbd3d11daa99cf78c9566a0a4798e/eggs/requests-2.13.0-py2.7.egg/requests/sessions.py", line 488, in request
resp = self.send(prep, **send_kwargs)
File "/srv/slapgrid/slappart9/srv/testnode/bvi/soft/65dbbd3d11daa99cf78c9566a0a4798e/eggs/requests-2.13.0-py2.7.egg/requests/sessions.py", line 609, in send
r = adapter.send(request, **kwargs)
File "/srv/slapgrid/slappart9/srv/testnode/bvi/soft/65dbbd3d11daa99cf78c9566a0a4798e/eggs/requests-2.13.0-py2.7.egg/requests/adapters.py", line 423, in send
timeout=timeout
File "/srv/slapgrid/slappart9/srv/testnode/bvi/soft/65dbbd3d11daa99cf78c9566a0a4798e/eggs/requests-2.13.0-py2.7.egg/requests/packages/urllib3/connectionpool.py", line 600, in urlopen
chunked=chunked)
File "/srv/slapgrid/slappart9/srv/testnode/bvi/soft/65dbbd3d11daa99cf78c9566a0a4798e/eggs/requests-2.13.0-py2.7.egg/requests/packages/urllib3/connectionpool.py", line 356, in _make_request
conn.request(method, url, **httplib_request_kw)
File "/srv/slapgrid/slappart9/srv/testnode/bvi/soft/65dbbd3d11daa99cf78c9566a0a4798e/parts/python2.7/lib/python2.7/httplib.py", line 1069, in request
self._send_request(method, url, body, headers)
File "/srv/slapgrid/slappart9/srv/testnode/bvi/soft/65dbbd3d11daa99cf78c9566a0a4798e/parts/python2.7/lib/python2.7/httplib.py", line 1109, in _send_request
self.endheaders(body)
File "/srv/slapgrid/slappart9/srv/testnode/bvi/soft/65dbbd3d11daa99cf78c9566a0a4798e/parts/python2.7/lib/python2.7/httplib.py", line 1065, in endheaders
self._send_output(message_body)
File "/srv/slapgrid/slappart9/srv/testnode/bvi/soft/65dbbd3d11daa99cf78c9566a0a4798e/parts/python2.7/lib/python2.7/httplib.py", line 892, in _send_output
self.send(msg)
File "/srv/slapgrid/slappart9/srv/testnode/bvi/soft/65dbbd3d11daa99cf78c9566a0a4798e/parts/python2.7/lib/python2.7/httplib.py", line 868, in send
self.sock.sendall(data)
File "/srv/slapgrid/slappart9/srv/testnode/bvi/soft/65dbbd3d11daa99cf78c9566a0a4798e/eggs/requests-2.13.0-py2.7.egg/requests/packages/urllib3/contrib/pyopenssl.py", line 311, in sendall
sent = self._send_until_done(data[total_sent:total_sent + SSL_WRITE_BLOCKSIZE])
File "/srv/slapgrid/slappart9/srv/testnode/bvi/soft/65dbbd3d11daa99cf78c9566a0a4798e/eggs/requests-2.13.0-py2.7.egg/requests/packages/urllib3/contrib/pyopenssl.py", line 301, in _send_until_done
return self.connection.send(data)
File "/srv/slapgrid/slappart9/srv/testnode/bvi/soft/65dbbd3d11daa99cf78c9566a0a4798e/eggs/pyOpenSSL-18.0.0-py2.7.egg/OpenSSL/SSL.py", line 1729, in send
self._raise_ssl_error(self._ssl, result)
File "/srv/slapgrid/slappart9/srv/testnode/bvi/soft/65dbbd3d11daa99cf78c9566a0a4798e/eggs/pyOpenSSL-18.0.0-py2.7.egg/OpenSSL/SSL.py", line 1631, in _raise_ssl_error
raise SysCallError(errno, errorcode.get(errno))
SysCallError: (104, 'ECONNRESET')

----------------------------------------------------------------------
Ran 76 tests in 69.275s

FAILED (errors=1, skipped=1)
Test failed: <unittest.runner.TextTestResult run=76 errors=1 failures=0>
error: Test failed: <unittest.runner.TextTestResult run=76 errors=1 failures=0>