VIFIB DESCENTRALIZED CLOUD COMPUTING

SlapOS is a decentralized Cloud Computing technology that can automate the deployment and configuration of applications in a heterogeneous environment.
kedifa
124.668
76
0
5
1
FAILED
Completed
SLAPOS_TEST_SHARED_PART_LIST= /srv/slapgrid/slappart9/srv/testnode/bvi/soft/65dbbd3d11daa99cf78c9566a0a4798e/bin/python_for_test setup.py test
Warning: build in /srv/slapgrid/slappart9/srv/testnode/bvi/soft/65dbbd3d11daa99cf78c9566a0a4798e/parts/kedifa-repository is using versioneer.py from /srv/slapgrid/slappart9/srv/testnode/bvi/inst/test0-0/parts/kedifa/versioneer.py
running test
running egg_info
creating kedifa.egg-info
writing requirements to kedifa.egg-info/requires.txt
writing kedifa.egg-info/PKG-INFO
writing top-level names to kedifa.egg-info/top_level.txt
writing dependency_links to kedifa.egg-info/dependency_links.txt
writing entry points to kedifa.egg-info/entry_points.txt
writing manifest file 'kedifa.egg-info/SOURCES.txt'
reading manifest file 'kedifa.egg-info/SOURCES.txt'
reading manifest template 'MANIFEST.in'
writing manifest file 'kedifa.egg-info/SOURCES.txt'
running build_ext
475685771105353508 was (originally) automatically approved
2169098116956003775 was (originally) automatically approved
5885556006212822646 was (originally) automatically approved
4130881966934599104 was (originally) automatically approved
8457219726206054299 was (originally) automatically approved
3196647503892415991 was (originally) automatically approved
u'https://[2001:67c:1254:e:7b::73ab]:56143/ucytz6pb39tj1gumujpdouzipe3oojgbMISSING' not downloaded, HTTP code 404
876034669008997542 was (originally) automatically approved
278875863742663679 was (originally) automatically approved
2691152463507591046 was (originally) automatically approved
3002698560768842927 was (originally) automatically approved
Certificate '/tmp/tmpNtcLVV/tmpe1LpAs': updated from 'https://[2001:67c:1254:e:7b::73ab]:41287/iz8vhugd41fj2c4ut1j5tgj7x6pquiy1'
7823779802068597605 was (originally) automatically approved
5431541761461074782 was (originally) automatically approved
Certificate '/tmp/tmp4IgpVU/tmp7Kfzr2': 'https://[2001:67c:1254:e:7b::73ab]:51263/mioaihmp513ix2n4bpeb8ktn62tyar91MISSING' not downloaded, HTTP code 404
8989854440271224674 was (originally) automatically approved
2120546050139091087 was (originally) automatically approved
6350539812040194967 was (originally) automatically approved
2147368091139704823 was (originally) automatically approved
7115511319042130521 was (originally) automatically approved
8721262248313770028 was (originally) automatically approved
u'https://[2001:67c:1254:e:7b::73ab]:49841/xmynpl4fp0a7efysgzhg1ugjtc8cyioc' not downloaded, problem (104, 'ECONNRESET')
127645828761180628 was (originally) automatically approved
6854064375883169740 was (originally) automatically approved
2518578776225607804 was (originally) automatically approved
5824504752288427015 was (originally) automatically approved
5828831921259581177 was (originally) automatically approved
5098310182704529844 was (originally) automatically approved
3260293069836427053 was (originally) automatically approved
465798275938076274 was (originally) automatically approved
8833783629896597519 was (originally) automatically approved
7657586996768273063 was (originally) automatically approved
3878332853094160777 was (originally) automatically approved
2236938354874212400 was (originally) automatically approved
5684352616406032503 was (originally) automatically approved
2410535402026626135 was (originally) automatically approved
5019876789332472408 was (originally) automatically approved
4228488145337210318 was (originally) automatically approved
1404208028485862953 was (originally) automatically approved
6052838002784545318 was (originally) automatically approved
981653294237783751 was (originally) automatically approved
3708508206160682787 was (originally) automatically approved
8981419333024754781 was (originally) automatically approved
4770726088960551750 was (originally) automatically approved
6997505996079522230 was (originally) automatically approved
8896607653560691549 was (originally) automatically approved
6491799986189237506 was (originally) automatically approved
8449584149777326533 was (originally) automatically approved
Certificate '/tmp/tmpq7asoQ/tmppg6MM8': problem with 'https://[2001:67c:1254:e:7b::73ab]:43443/n0wmh7gozfdx0dcf5q321cgnmbyat6qg' not downloaded: (104, 'ECONNRESET')
7347447935096181291 was (originally) automatically approved
4605610881155763503 was (originally) automatically approved
5608620410524949940 was (originally) automatically approved
4339937150048045981 was (originally) automatically approved
1990247248256059657 was (originally) automatically approved
8821113924359853409 was (originally) automatically approved
6489107446952979801 was (originally) automatically approved
3864952538455057460 was (originally) automatically approved
8629503496248004491 was (originally) automatically approved
2379797018851485138 was (originally) automatically approved
923333971180673602 was (originally) automatically approved
5309714716749385901 was (originally) automatically approved
1791038532466132369 was (originally) automatically approved
1749723986834648526 was (originally) automatically approved
7053524426877377001 was (originally) automatically approved
8085513953294463838 was (originally) automatically approved
2526026634689400808 was (originally) automatically approved
6473384533123558949 was (originally) automatically approved
7989002328320149332 was (originally) automatically approved
7596336504565366797 was (originally) automatically approved
8061903730751234743 was (originally) automatically approved
5011394995086488584 was (originally) automatically approved
2846204091398709563 was (originally) automatically approved
8445076787161514814 was (originally) automatically approved
6007479140531722176 was (originally) automatically approved
4753033209555013211 was (originally) automatically approved
Sleeping for 1s
Couldn't lock '/tmp/tmpUKateK/tmpDxM_6_.lock'
...exiting.
Line 'buzz' is incorrect
Prepare: Used '/tmp/tmpGbhoCk/tmpi4cj1t' for '/tmp/tmpGbhoCk/tmpH8pDJH'
Prepare: Used '/tmp/tmpaMm5iP/tmpV4CbD0' for '/tmp/tmpaMm5iP/tmpxnH9GF'
Prepare: Used '/tmp/tmpLZdGvT/tmpyHTXZ_' for '/tmp/tmpLZdGvT/tmpv6sWH1'
Certificate '/tmp/tmpGQRHfq/tmpmfo5yi': updated from 'http://example.com'
Certificate '/tmp/tmpiSDfTD/tmpkrdvDI': updated from 'http://example.com'
Certificate '/tmp/tmpghOr1M/tmpU9KM3O': updated from 'http://example.com'
Certificate '/tmp/tmpraVUxt/tmp4eRItZ': updated from 'http://example.com'
Certificate '/tmp/tmppOPHFZ/tmpElR2F7': updated from 'http://example.com'
Certificate '/tmp/tmpogsmr_/tmp8EJpVb': updated from 'http://example.com'
Certificate '/tmp/tmpvZaW5P/tmp5slBUr': updated from 'http://example.com'
Certificate '/tmp/tmpqLr5ra/tmp_oIkJD': updated from 'http://example.com'
Certificate '/tmp/tmpPdktCT/tmp8YRbUo': updated from 'http://example.com'
Certificate '/tmp/tmpGTE8uj/tmpkgxHmP': updated from 'http://example.com'
Certificate '/tmp/tmpMbQOru/tmpKRiu_p': updated from 'http://example.com'
Certificate '/tmp/tmpkzWoGJ/tmpWuk33_': updated from '/master/certificate/file'
Certificate '/tmp/tmp5Z3Ik8/tmpYXu6xz': updated from 'http://example.com'
test_GET_cleanCertificate (kedifa.test.KedifaIntegrationTest) ... Listening on [2001:67c:1254:e:7b::73ab]:51095-51096
ok
test_GET_existing (kedifa.test.KedifaIntegrationTest) ... ERROR
test_GET_existing_exact (kedifa.test.KedifaIntegrationTest) ... ERROR
test_GET_existing_getter (kedifa.test.KedifaIntegrationTest) ... Listening on [2001:67c:1254:e:7b::73ab]:52697-52698
ok
test_GET_existing_getter_name_does_not_match (kedifa.test.KedifaIntegrationTest) ... Listening on [2001:67c:1254:e:7b::73ab]:50311-50312
ok
test_GET_existing_no_identity (kedifa.test.KedifaIntegrationTest) ... Listening on [2001:67c:1254:e:7b::73ab]:56551-56552
ok
test_GET_existing_updater (kedifa.test.KedifaIntegrationTest) ... Listening on [2001:67c:1254:e:7b::73ab]:48709-48710
ok
test_GET_existing_updater_name_does_not_match (kedifa.test.KedifaIntegrationTest) ... Listening on [2001:67c:1254:e:7b::73ab]:53367-53368
ok
test_GET_expired (kedifa.test.KedifaIntegrationTest) ... Listening on [2001:67c:1254:e:7b::73ab]:48227-48228
ERROR
test_GET_expired_identity (kedifa.test.KedifaIntegrationTest) ... skipped 'Hard to implement, and already being partially covered by test_GET_revoked_identity'
test_GET_generateauth (kedifa.test.KedifaIntegrationTest) ... Listening on [2001:67c:1254:e:7b::73ab]:45937-45938
ok
test_GET_generateauth_no_reserved (kedifa.test.KedifaIntegrationTest) ... Listening on [2001:67c:1254:e:7b::73ab]:35607-35608
ok
test_GET_getter_unsigned_identity (kedifa.test.KedifaIntegrationTest) ... Listening on [2001:67c:1254:e:7b::73ab]:53891-53892
ok
test_GET_invalid_yet (kedifa.test.KedifaIntegrationTest) ... Listening on [2001:67c:1254:e:7b::73ab]:50309-50310
ok
test_GET_list (kedifa.test.KedifaIntegrationTest) ... Listening on [2001:67c:1254:e:7b::73ab]:54705-54706
ok
test_GET_list_cleanCertificate (kedifa.test.KedifaIntegrationTest) ... Listening on [2001:67c:1254:e:7b::73ab]:34243-34244
ok
test_GET_list_empty (kedifa.test.KedifaIntegrationTest) ... Listening on [2001:67c:1254:e:7b::73ab]:48271-48272
ok
test_GET_list_no_identity (kedifa.test.KedifaIntegrationTest) ... Listening on [2001:67c:1254:e:7b::73ab]:57757-57758
ok
test_GET_new_server_ca (kedifa.test.KedifaIntegrationTest) ... Listening on [2001:67c:1254:e:7b::73ab]:50505-50506
Listening on [2001:67c:1254:e:7b::73ab]:37517-37518
ok
test_GET_not_existing (kedifa.test.KedifaIntegrationTest) ... Listening on [2001:67c:1254:e:7b::73ab]:45951-45952
ok
test_GET_order (kedifa.test.KedifaIntegrationTest) ... Listening on [2001:67c:1254:e:7b::73ab]:49595-49596
ok
test_GET_revoked_identity (kedifa.test.KedifaIntegrationTest) ... Listening on [2001:67c:1254:e:7b::73ab]:43305-43306
ok
test_GET_root (kedifa.test.KedifaIntegrationTest) ... Listening on [2001:67c:1254:e:7b::73ab]:54385-54386
ok
test_GET_unsigned_identity (kedifa.test.KedifaIntegrationTest) ... Listening on [2001:67c:1254:e:7b::73ab]:57053-57054
ERROR
test_GET_updater_unsigned_identity (kedifa.test.KedifaIntegrationTest) ... Listening on [2001:67c:1254:e:7b::73ab]:42727-42728
ok
test_PUT (kedifa.test.KedifaIntegrationTest) ... Listening on [2001:67c:1254:e:7b::73ab]:52767-52768
ok
test_PUT_bad (kedifa.test.KedifaIntegrationTest) ... Listening on [2001:67c:1254:e:7b::73ab]:37085-37086
ok
test_PUT_bad_auth (kedifa.test.KedifaIntegrationTest) ... Listening on [2001:67c:1254:e:7b::73ab]:53849-53850
ok
test_PUT_certificate_expired (kedifa.test.KedifaIntegrationTest) ... ERROR
test_PUT_certificate_key_mismatch (kedifa.test.KedifaIntegrationTest) ... Listening on [2001:67c:1254:e:7b::73ab]:38735-38736
ok
test_PUT_certificate_not_valid_yet (kedifa.test.KedifaIntegrationTest) ... Listening on [2001:67c:1254:e:7b::73ab]:42265-42266
ok
test_PUT_certificate_only (kedifa.test.KedifaIntegrationTest) ... Listening on [2001:67c:1254:e:7b::73ab]:40477-40478
ok
test_PUT_key_before_certificate (kedifa.test.KedifaIntegrationTest) ... Listening on [2001:67c:1254:e:7b::73ab]:52799-52800
ok
test_PUT_key_only (kedifa.test.KedifaIntegrationTest) ... Listening on [2001:67c:1254:e:7b::73ab]:52055-52056
ok
test_PUT_multiple_different_reference (kedifa.test.KedifaIntegrationTest) ... Listening on [2001:67c:1254:e:7b::73ab]:60303-60304
ok
test_PUT_multiple_same_reference (kedifa.test.KedifaIntegrationTest) ... Listening on [2001:67c:1254:e:7b::73ab]:48499-48500
ok
test_PUT_no_auth (kedifa.test.KedifaIntegrationTest) ... Listening on [2001:67c:1254:e:7b::73ab]:60633-60634
ok
test_bad_query_string (kedifa.test.KedifaIntegrationTest) ... Listening on [2001:67c:1254:e:7b::73ab]:57099-57100
ok
test_reload_log (kedifa.test.KedifaIntegrationTest) ... Listening on [2001:67c:1254:e:7b::73ab]:34763-34764
ok
test (kedifa.test.KedifaUpdaterLoopTest) ... ok
test_infinite (kedifa.test.KedifaUpdaterLoopTest) ... ok
test_lock (kedifa.test.KedifaUpdaterLoopTest) ... ok
test_raises (kedifa.test.KedifaUpdaterLoopTest) ... ok
test_updateMapping_empty (kedifa.test.KedifaUpdaterMappingTest) ... ok
test_updateMapping_morewhite (kedifa.test.KedifaUpdaterMappingTest) ... ok
test_updateMapping_normal (kedifa.test.KedifaUpdaterMappingTest) ... ok
test_updateMapping_one_comment (kedifa.test.KedifaUpdaterMappingTest) ... ok
test_updateMapping_one_empty (kedifa.test.KedifaUpdaterMappingTest) ... ok
test_updateMapping_one_not_enough (kedifa.test.KedifaUpdaterMappingTest) ... ok
test_updateMapping_with_fallback (kedifa.test.KedifaUpdaterMappingTest) ... ok
test_cert_master_fallback (kedifa.test.KedifaUpdaterUpdateCertificatePrepareTest) ... ok
test_cert_master_nofallback (kedifa.test.KedifaUpdaterUpdateCertificatePrepareTest) ... ok
test_cert_nomaster_fallback (kedifa.test.KedifaUpdaterUpdateCertificatePrepareTest) ... ok
test_cert_nomaster_nofallback (kedifa.test.KedifaUpdaterUpdateCertificatePrepareTest) ... ok
test_nocert_master_fallback (kedifa.test.KedifaUpdaterUpdateCertificatePrepareTest) ... ok
test_nocert_master_nofallback (kedifa.test.KedifaUpdaterUpdateCertificatePrepareTest) ... ok
test_nocert_nomaster_fallback (kedifa.test.KedifaUpdaterUpdateCertificatePrepareTest) ... ok
test_nocert_nomaster_nofallback (kedifa.test.KedifaUpdaterUpdateCertificatePrepareTest) ... ok
test_cert_fetch_master_fallback (kedifa.test.KedifaUpdaterUpdateCertificateTest) ... ok
test_cert_fetch_master_nofallback (kedifa.test.KedifaUpdaterUpdateCertificateTest) ... ok
test_cert_fetch_nomaster_fallback (kedifa.test.KedifaUpdaterUpdateCertificateTest) ... ok
test_cert_fetch_nomaster_nofallback (kedifa.test.KedifaUpdaterUpdateCertificateTest) ... ok
test_cert_nofetch_master_fallback (kedifa.test.KedifaUpdaterUpdateCertificateTest) ... ok
test_cert_nofetch_master_fallback_overridden (kedifa.test.KedifaUpdaterUpdateCertificateTest) ... ok
test_cert_nofetch_master_nofallback (kedifa.test.KedifaUpdaterUpdateCertificateTest) ... ok
test_cert_nofetch_nomaster_fallback (kedifa.test.KedifaUpdaterUpdateCertificateTest) ... ok
test_cert_nofetch_nomaster_fallback_overridden (kedifa.test.KedifaUpdaterUpdateCertificateTest) ... ok
test_cert_nofetch_nomaster_nofallback (kedifa.test.KedifaUpdaterUpdateCertificateTest) ... ok
test_nocert_fetch_master_fallback (kedifa.test.KedifaUpdaterUpdateCertificateTest) ... ok
test_nocert_fetch_master_nofallback (kedifa.test.KedifaUpdaterUpdateCertificateTest) ... ok
test_nocert_fetch_nomaster_fallback (kedifa.test.KedifaUpdaterUpdateCertificateTest) ... ok
test_nocert_fetch_nomaster_nofallback (kedifa.test.KedifaUpdaterUpdateCertificateTest) ... ok
test_nocert_nofetch_master_fallback (kedifa.test.KedifaUpdaterUpdateCertificateTest) ... ok
test_nocert_nofetch_master_nofallback (kedifa.test.KedifaUpdaterUpdateCertificateTest) ... ok
test_nocert_nofetch_nomaster_fallback (kedifa.test.KedifaUpdaterUpdateCertificateTest) ... ok
test_nocert_nofetch_nomaster_nofallback (kedifa.test.KedifaUpdaterUpdateCertificateTest) ... ok

======================================================================
ERROR: test_GET_existing (kedifa.test.KedifaIntegrationTest)
----------------------------------------------------------------------
Traceback (most recent call last):
File "/srv/slapgrid/slappart9/srv/testnode/bvi/inst/test0-0/parts/kedifa/kedifa/test.py", line 295, in setUp
self.setUpCaucase()
File "/srv/slapgrid/slappart9/srv/testnode/bvi/inst/test0-0/parts/kedifa/kedifa/test.py", line 182, in setUpCaucase
'Caucase not available after %.2fs seconds' % (time.time() - b))
AssertionError: Caucase not available after 5.10s seconds

======================================================================
ERROR: test_GET_existing_exact (kedifa.test.KedifaIntegrationTest)
----------------------------------------------------------------------
Traceback (most recent call last):
File "/srv/slapgrid/slappart9/srv/testnode/bvi/inst/test0-0/parts/kedifa/kedifa/test.py", line 295, in setUp
self.setUpCaucase()
File "/srv/slapgrid/slappart9/srv/testnode/bvi/inst/test0-0/parts/kedifa/kedifa/test.py", line 182, in setUpCaucase
'Caucase not available after %.2fs seconds' % (time.time() - b))
AssertionError: Caucase not available after 5.09s seconds

======================================================================
ERROR: test_GET_expired (kedifa.test.KedifaIntegrationTest)
----------------------------------------------------------------------
Traceback (most recent call last):
File "/srv/slapgrid/slappart9/srv/testnode/bvi/inst/test0-0/parts/kedifa/kedifa/test.py", line 295, in setUp
self.setUpCaucase()
File "/srv/slapgrid/slappart9/srv/testnode/bvi/inst/test0-0/parts/kedifa/kedifa/test.py", line 182, in setUpCaucase
'Caucase not available after %.2fs seconds' % (time.time() - b))
AssertionError: Caucase not available after 5.10s seconds

======================================================================
ERROR: test_GET_unsigned_identity (kedifa.test.KedifaIntegrationTest)
----------------------------------------------------------------------
Traceback (most recent call last):
File "/srv/slapgrid/slappart9/srv/testnode/bvi/inst/test0-0/parts/kedifa/kedifa/test.py", line 431, in test_GET_unsigned_identity
self.kedifa_url + self.reference, cert=incorrect_key_pem)
File "/srv/slapgrid/slappart9/srv/testnode/bvi/inst/test0-0/parts/kedifa/kedifa/test.py", line 303, in requests_get
return requests.get(verify=self.ca_crt_pem, *args, **kwargs)
File "/srv/slapgrid/slappart9/srv/testnode/bvi/soft/65dbbd3d11daa99cf78c9566a0a4798e/eggs/requests-2.13.0-py2.7.egg/requests/api.py", line 70, in get
return request('get', url, params=params, **kwargs)
File "/srv/slapgrid/slappart9/srv/testnode/bvi/soft/65dbbd3d11daa99cf78c9566a0a4798e/eggs/requests-2.13.0-py2.7.egg/requests/api.py", line 56, in request
return session.request(method=method, url=url, **kwargs)
File "/srv/slapgrid/slappart9/srv/testnode/bvi/soft/65dbbd3d11daa99cf78c9566a0a4798e/eggs/requests-2.13.0-py2.7.egg/requests/sessions.py", line 488, in request
resp = self.send(prep, **send_kwargs)
File "/srv/slapgrid/slappart9/srv/testnode/bvi/soft/65dbbd3d11daa99cf78c9566a0a4798e/eggs/requests-2.13.0-py2.7.egg/requests/sessions.py", line 609, in send
r = adapter.send(request, **kwargs)
File "/srv/slapgrid/slappart9/srv/testnode/bvi/soft/65dbbd3d11daa99cf78c9566a0a4798e/eggs/requests-2.13.0-py2.7.egg/requests/adapters.py", line 423, in send
timeout=timeout
File "/srv/slapgrid/slappart9/srv/testnode/bvi/soft/65dbbd3d11daa99cf78c9566a0a4798e/eggs/requests-2.13.0-py2.7.egg/requests/packages/urllib3/connectionpool.py", line 600, in urlopen
chunked=chunked)
File "/srv/slapgrid/slappart9/srv/testnode/bvi/soft/65dbbd3d11daa99cf78c9566a0a4798e/eggs/requests-2.13.0-py2.7.egg/requests/packages/urllib3/connectionpool.py", line 356, in _make_request
conn.request(method, url, **httplib_request_kw)
File "/srv/slapgrid/slappart9/srv/testnode/bvi/soft/65dbbd3d11daa99cf78c9566a0a4798e/parts/python2.7/lib/python2.7/httplib.py", line 1069, in request
self._send_request(method, url, body, headers)
File "/srv/slapgrid/slappart9/srv/testnode/bvi/soft/65dbbd3d11daa99cf78c9566a0a4798e/parts/python2.7/lib/python2.7/httplib.py", line 1109, in _send_request
self.endheaders(body)
File "/srv/slapgrid/slappart9/srv/testnode/bvi/soft/65dbbd3d11daa99cf78c9566a0a4798e/parts/python2.7/lib/python2.7/httplib.py", line 1065, in endheaders
self._send_output(message_body)
File "/srv/slapgrid/slappart9/srv/testnode/bvi/soft/65dbbd3d11daa99cf78c9566a0a4798e/parts/python2.7/lib/python2.7/httplib.py", line 892, in _send_output
self.send(msg)
File "/srv/slapgrid/slappart9/srv/testnode/bvi/soft/65dbbd3d11daa99cf78c9566a0a4798e/parts/python2.7/lib/python2.7/httplib.py", line 868, in send
self.sock.sendall(data)
File "/srv/slapgrid/slappart9/srv/testnode/bvi/soft/65dbbd3d11daa99cf78c9566a0a4798e/eggs/requests-2.13.0-py2.7.egg/requests/packages/urllib3/contrib/pyopenssl.py", line 311, in sendall
sent = self._send_until_done(data[total_sent:total_sent + SSL_WRITE_BLOCKSIZE])
File "/srv/slapgrid/slappart9/srv/testnode/bvi/soft/65dbbd3d11daa99cf78c9566a0a4798e/eggs/requests-2.13.0-py2.7.egg/requests/packages/urllib3/contrib/pyopenssl.py", line 301, in _send_until_done
return self.connection.send(data)
File "/srv/slapgrid/slappart9/srv/testnode/bvi/soft/65dbbd3d11daa99cf78c9566a0a4798e/eggs/pyOpenSSL-18.0.0-py2.7.egg/OpenSSL/SSL.py", line 1729, in send
self._raise_ssl_error(self._ssl, result)
File "/srv/slapgrid/slappart9/srv/testnode/bvi/soft/65dbbd3d11daa99cf78c9566a0a4798e/eggs/pyOpenSSL-18.0.0-py2.7.egg/OpenSSL/SSL.py", line 1631, in _raise_ssl_error
raise SysCallError(errno, errorcode.get(errno))
SysCallError: (104, 'ECONNRESET')

======================================================================
ERROR: test_PUT_certificate_expired (kedifa.test.KedifaIntegrationTest)
----------------------------------------------------------------------
Traceback (most recent call last):
File "/srv/slapgrid/slappart9/srv/testnode/bvi/inst/test0-0/parts/kedifa/kedifa/test.py", line 295, in setUp
self.setUpCaucase()
File "/srv/slapgrid/slappart9/srv/testnode/bvi/inst/test0-0/parts/kedifa/kedifa/test.py", line 182, in setUpCaucase
'Caucase not available after %.2fs seconds' % (time.time() - b))
AssertionError: Caucase not available after 5.10s seconds

----------------------------------------------------------------------
Ran 76 tests in 124.668s

FAILED (errors=5, skipped=1)
Test failed: <unittest.runner.TextTestResult run=76 errors=5 failures=0>
error: Test failed: <unittest.runner.TextTestResult run=76 errors=5 failures=0>