VIFIB DESCENTRALIZED CLOUD COMPUTING

SlapOS is a decentralized Cloud Computing technology that can automate the deployment and configuration of applications in a heterogeneous environment.
kedifa
73.063
76
0
1
1
FAILED
Completed
SLAPOS_TEST_SHARED_PART_LIST= /srv/slapgrid/slappart9/srv/testnode/bvi/soft/65dbbd3d11daa99cf78c9566a0a4798e/bin/python_for_test setup.py test
Warning: build in /srv/slapgrid/slappart9/srv/testnode/bvi/soft/65dbbd3d11daa99cf78c9566a0a4798e/parts/kedifa-repository is using versioneer.py from /srv/slapgrid/slappart9/srv/testnode/bvi/inst/test0-0/parts/kedifa/versioneer.py
running test
running egg_info
creating kedifa.egg-info
writing requirements to kedifa.egg-info/requires.txt
writing kedifa.egg-info/PKG-INFO
writing top-level names to kedifa.egg-info/top_level.txt
writing dependency_links to kedifa.egg-info/dependency_links.txt
writing entry points to kedifa.egg-info/entry_points.txt
writing manifest file 'kedifa.egg-info/SOURCES.txt'
reading manifest file 'kedifa.egg-info/SOURCES.txt'
reading manifest template 'MANIFEST.in'
writing manifest file 'kedifa.egg-info/SOURCES.txt'
running build_ext
6260119927038017407 was (originally) automatically approved
2415183214715586274 was (originally) automatically approved
2714159987344145722 was (originally) automatically approved
3658761959825643026 was (originally) automatically approved
25353199511550779 was (originally) automatically approved
4029774844561414909 was (originally) automatically approved
7152380762391921354 was (originally) automatically approved
188143258467969010 was (originally) automatically approved
9004033038933718607 was (originally) automatically approved
3175319209901585005 was (originally) automatically approved
u'https://[2001:67c:1254:e:7b::73ab]:58553/tjhbwv3vjlilv7h7xj0ugh84b9vja5dyMISSING' not downloaded, HTTP code 404
585328911171754221 was (originally) automatically approved
6586144307636003988 was (originally) automatically approved
5857113436912922207 was (originally) automatically approved
4845285160013509592 was (originally) automatically approved
Certificate '/tmp/tmpFv1DHg/tmpqwZygL': updated from 'https://[2001:67c:1254:e:7b::73ab]:52489/sfy16fcwk0p0r236tg2k1y9hs0yuzwyh'
7671111094797993752 was (originally) automatically approved
4883342083136005048 was (originally) automatically approved
Certificate '/tmp/tmpuMq_ot/tmpfSN239': 'https://[2001:67c:1254:e:7b::73ab]:60913/muc993s7t183gmkrzgi9i5hxamkficogMISSING' not downloaded, HTTP code 404
5383064042770450517 was (originally) automatically approved
3321720300406510420 was (originally) automatically approved
3244218205660822042 was (originally) automatically approved
8573121831949773275 was (originally) automatically approved
2305154222814156540 was (originally) automatically approved
3950659466461469871 was (originally) automatically approved
382540189547566104 was (originally) automatically approved
5527297376611577196 was (originally) automatically approved
u'https://[2001:67c:1254:e:7b::73ab]:52201/fuygrw0x0vc2pscuvlgn1928sud7picy' not downloaded, problem (104, 'ECONNRESET')
807938648271009524 was (originally) automatically approved
1792373120867716554 was (originally) automatically approved
3035955984758393034 was (originally) automatically approved
6660713826789523658 was (originally) automatically approved
3373863202038895247 was (originally) automatically approved
4446429767903175933 was (originally) automatically approved
2506830815060444781 was (originally) automatically approved
3809870543711151255 was (originally) automatically approved
8968618577845359371 was (originally) automatically approved
3248078143823428898 was (originally) automatically approved
4864699412325350399 was (originally) automatically approved
6206250323503550821 was (originally) automatically approved
6093294703726650599 was (originally) automatically approved
8507875022760349073 was (originally) automatically approved
6213876243116144741 was (originally) automatically approved
2563415132614898919 was (originally) automatically approved
2750303409084615288 was (originally) automatically approved
809098848809136949 was (originally) automatically approved
8840928263630648955 was (originally) automatically approved
1796678492451745735 was (originally) automatically approved
7414794186670676813 was (originally) automatically approved
2043347658467347522 was (originally) automatically approved
1506187084842048910 was (originally) automatically approved
429154873255150519 was (originally) automatically approved
5050064589671517603 was (originally) automatically approved
2725848972310300658 was (originally) automatically approved
Certificate '/tmp/tmp2l89AG/tmpuji8RL': problem with 'https://[2001:67c:1254:e:7b::73ab]:33593/22d8hk1f1jrihrbh7jxtkio3lg0m4f9s' not downloaded: (104, 'ECONNRESET')
4377996941352093401 was (originally) automatically approved
2037016324357023719 was (originally) automatically approved
480082445316381867 was (originally) automatically approved
2430813304490242078 was (originally) automatically approved
4777374041352684993 was (originally) automatically approved
5030921649051124177 was (originally) automatically approved
8497433448145623482 was (originally) automatically approved
6961874599786315809 was (originally) automatically approved
6345184034536585269 was (originally) automatically approved
7165006416763689896 was (originally) automatically approved
8698331426528258912 was (originally) automatically approved
5689731725737775654 was (originally) automatically approved
6169173482861266446 was (originally) automatically approved
3297648699896209949 was (originally) automatically approved
4926250042572568338 was (originally) automatically approved
5563464543983322885 was (originally) automatically approved
7081472068428258984 was (originally) automatically approved
3417415743155107754 was (originally) automatically approved
6247238596263246422 was (originally) automatically approved
1520483847939003540 was (originally) automatically approved
3273665894907595045 was (originally) automatically approved
3698476751121111233 was (originally) automatically approved
796283728614395903 was (originally) automatically approved
2170492674421327692 was (originally) automatically approved
5220661647869010926 was (originally) automatically approved
691426404038575343 was (originally) automatically approved
2856157323240459754 was (originally) automatically approved
1801417818198616083 was (originally) automatically approved
Sleeping for 1s
Couldn't lock '/tmp/tmpuKlrpU/tmpycNNeK.lock'
...exiting.
Line 'buzz' is incorrect
Prepare: Used '/tmp/tmpt4iiHW/tmpEqWvYv' for '/tmp/tmpt4iiHW/tmpdsT7Q5'
Prepare: Used '/tmp/tmp4PxVFx/tmp6Q3ecX' for '/tmp/tmp4PxVFx/tmp4Ag8xl'
Prepare: Used '/tmp/tmpXrNztP/tmpHIUmIB' for '/tmp/tmpXrNztP/tmpjzy88d'
Certificate '/tmp/tmpbOaanm/tmpeiIH4l': updated from 'http://example.com'
Certificate '/tmp/tmp1iQX5M/tmpZv1jRf': updated from 'http://example.com'
Certificate '/tmp/tmpN6ZhAR/tmpWy2dJx': updated from 'http://example.com'
Certificate '/tmp/tmpdRWh4p/tmpwmgYd1': updated from 'http://example.com'
Certificate '/tmp/tmpbfZNST/tmpvwG45t': updated from 'http://example.com'
Certificate '/tmp/tmpi4uxNN/tmpf683zb': updated from 'http://example.com'
Certificate '/tmp/tmpHBDElw/tmp3yG1ZS': updated from 'http://example.com'
Certificate '/tmp/tmprIsJq8/tmpbvT9sF': updated from 'http://example.com'
Certificate '/tmp/tmpPehStd/tmpQMehio': updated from 'http://example.com'
Certificate '/tmp/tmpY5gV26/tmp9Bb5hW': updated from 'http://example.com'
Certificate '/tmp/tmpU325Wf/tmpcMmvJ8': updated from 'http://example.com'
Certificate '/tmp/tmp_51lI6/tmpBScHtP': updated from '/master/certificate/file'
Certificate '/tmp/tmpo4jCWt/tmpNCBGnR': updated from 'http://example.com'
test_GET_cleanCertificate (kedifa.test.KedifaIntegrationTest) ... Listening on [2001:67c:1254:e:7b::73ab]:37247-37248
ok
test_GET_existing (kedifa.test.KedifaIntegrationTest) ... Listening on [2001:67c:1254:e:7b::73ab]:51279-51280
ok
test_GET_existing_exact (kedifa.test.KedifaIntegrationTest) ... Listening on [2001:67c:1254:e:7b::73ab]:52635-52636
ok
test_GET_existing_getter (kedifa.test.KedifaIntegrationTest) ... Listening on [2001:67c:1254:e:7b::73ab]:34911-34912
ok
test_GET_existing_getter_name_does_not_match (kedifa.test.KedifaIntegrationTest) ... Listening on [2001:67c:1254:e:7b::73ab]:56275-56276
ok
test_GET_existing_no_identity (kedifa.test.KedifaIntegrationTest) ... Listening on [2001:67c:1254:e:7b::73ab]:60927-60928
ok
test_GET_existing_updater (kedifa.test.KedifaIntegrationTest) ... Listening on [2001:67c:1254:e:7b::73ab]:48371-48372
ok
test_GET_existing_updater_name_does_not_match (kedifa.test.KedifaIntegrationTest) ... Listening on [2001:67c:1254:e:7b::73ab]:36569-36570
ok
test_GET_expired (kedifa.test.KedifaIntegrationTest) ... Listening on [2001:67c:1254:e:7b::73ab]:48935-48936
ok
test_GET_expired_identity (kedifa.test.KedifaIntegrationTest) ... skipped 'Hard to implement, and already being partially covered by test_GET_revoked_identity'
test_GET_generateauth (kedifa.test.KedifaIntegrationTest) ... Listening on [2001:67c:1254:e:7b::73ab]:41917-41918
ok
test_GET_generateauth_no_reserved (kedifa.test.KedifaIntegrationTest) ... Listening on [2001:67c:1254:e:7b::73ab]:39911-39912
ok
test_GET_getter_unsigned_identity (kedifa.test.KedifaIntegrationTest) ... Listening on [2001:67c:1254:e:7b::73ab]:35555-35556
ok
test_GET_invalid_yet (kedifa.test.KedifaIntegrationTest) ... Listening on [2001:67c:1254:e:7b::73ab]:49789-49790
ok
test_GET_list (kedifa.test.KedifaIntegrationTest) ... Listening on [2001:67c:1254:e:7b::73ab]:56697-56698
ok
test_GET_list_cleanCertificate (kedifa.test.KedifaIntegrationTest) ... Listening on [2001:67c:1254:e:7b::73ab]:38297-38298
ok
test_GET_list_empty (kedifa.test.KedifaIntegrationTest) ... Listening on [2001:67c:1254:e:7b::73ab]:54535-54536
ok
test_GET_list_no_identity (kedifa.test.KedifaIntegrationTest) ... Listening on [2001:67c:1254:e:7b::73ab]:38119-38120
ok
test_GET_new_server_ca (kedifa.test.KedifaIntegrationTest) ... Listening on [2001:67c:1254:e:7b::73ab]:59617-59618
Listening on [2001:67c:1254:e:7b::73ab]:32983-32984
ok
test_GET_not_existing (kedifa.test.KedifaIntegrationTest) ... Listening on [2001:67c:1254:e:7b::73ab]:54537-54538
ok
test_GET_order (kedifa.test.KedifaIntegrationTest) ... Listening on [2001:67c:1254:e:7b::73ab]:55181-55182
ok
test_GET_revoked_identity (kedifa.test.KedifaIntegrationTest) ... Listening on [2001:67c:1254:e:7b::73ab]:55687-55688
ok
test_GET_root (kedifa.test.KedifaIntegrationTest) ... Listening on [2001:67c:1254:e:7b::73ab]:57121-57122
ok
test_GET_unsigned_identity (kedifa.test.KedifaIntegrationTest) ... Listening on [2001:67c:1254:e:7b::73ab]:45811-45812
ERROR
test_GET_updater_unsigned_identity (kedifa.test.KedifaIntegrationTest) ... Listening on [2001:67c:1254:e:7b::73ab]:36519-36520
ok
test_PUT (kedifa.test.KedifaIntegrationTest) ... Listening on [2001:67c:1254:e:7b::73ab]:46633-46634
ok
test_PUT_bad (kedifa.test.KedifaIntegrationTest) ... Listening on [2001:67c:1254:e:7b::73ab]:53681-53682
ok
test_PUT_bad_auth (kedifa.test.KedifaIntegrationTest) ... Listening on [2001:67c:1254:e:7b::73ab]:33633-33634
ok
test_PUT_certificate_expired (kedifa.test.KedifaIntegrationTest) ... Listening on [2001:67c:1254:e:7b::73ab]:50721-50722
ok
test_PUT_certificate_key_mismatch (kedifa.test.KedifaIntegrationTest) ... Listening on [2001:67c:1254:e:7b::73ab]:42879-42880
ok
test_PUT_certificate_not_valid_yet (kedifa.test.KedifaIntegrationTest) ... Listening on [2001:67c:1254:e:7b::73ab]:43155-43156
ok
test_PUT_certificate_only (kedifa.test.KedifaIntegrationTest) ... Listening on [2001:67c:1254:e:7b::73ab]:48143-48144
ok
test_PUT_key_before_certificate (kedifa.test.KedifaIntegrationTest) ... Listening on [2001:67c:1254:e:7b::73ab]:53477-53478
ok
test_PUT_key_only (kedifa.test.KedifaIntegrationTest) ... Listening on [2001:67c:1254:e:7b::73ab]:47807-47808
ok
test_PUT_multiple_different_reference (kedifa.test.KedifaIntegrationTest) ... Listening on [2001:67c:1254:e:7b::73ab]:54189-54190
ok
test_PUT_multiple_same_reference (kedifa.test.KedifaIntegrationTest) ... Listening on [2001:67c:1254:e:7b::73ab]:49749-49750
ok
test_PUT_no_auth (kedifa.test.KedifaIntegrationTest) ... Listening on [2001:67c:1254:e:7b::73ab]:60413-60414
ok
test_bad_query_string (kedifa.test.KedifaIntegrationTest) ... Listening on [2001:67c:1254:e:7b::73ab]:60465-60466
ok
test_reload_log (kedifa.test.KedifaIntegrationTest) ... Listening on [2001:67c:1254:e:7b::73ab]:56327-56328
ok
test (kedifa.test.KedifaUpdaterLoopTest) ... ok
test_infinite (kedifa.test.KedifaUpdaterLoopTest) ... ok
test_lock (kedifa.test.KedifaUpdaterLoopTest) ... ok
test_raises (kedifa.test.KedifaUpdaterLoopTest) ... ok
test_updateMapping_empty (kedifa.test.KedifaUpdaterMappingTest) ... ok
test_updateMapping_morewhite (kedifa.test.KedifaUpdaterMappingTest) ... ok
test_updateMapping_normal (kedifa.test.KedifaUpdaterMappingTest) ... ok
test_updateMapping_one_comment (kedifa.test.KedifaUpdaterMappingTest) ... ok
test_updateMapping_one_empty (kedifa.test.KedifaUpdaterMappingTest) ... ok
test_updateMapping_one_not_enough (kedifa.test.KedifaUpdaterMappingTest) ... ok
test_updateMapping_with_fallback (kedifa.test.KedifaUpdaterMappingTest) ... ok
test_cert_master_fallback (kedifa.test.KedifaUpdaterUpdateCertificatePrepareTest) ... ok
test_cert_master_nofallback (kedifa.test.KedifaUpdaterUpdateCertificatePrepareTest) ... ok
test_cert_nomaster_fallback (kedifa.test.KedifaUpdaterUpdateCertificatePrepareTest) ... ok
test_cert_nomaster_nofallback (kedifa.test.KedifaUpdaterUpdateCertificatePrepareTest) ... ok
test_nocert_master_fallback (kedifa.test.KedifaUpdaterUpdateCertificatePrepareTest) ... ok
test_nocert_master_nofallback (kedifa.test.KedifaUpdaterUpdateCertificatePrepareTest) ... ok
test_nocert_nomaster_fallback (kedifa.test.KedifaUpdaterUpdateCertificatePrepareTest) ... ok
test_nocert_nomaster_nofallback (kedifa.test.KedifaUpdaterUpdateCertificatePrepareTest) ... ok
test_cert_fetch_master_fallback (kedifa.test.KedifaUpdaterUpdateCertificateTest) ... ok
test_cert_fetch_master_nofallback (kedifa.test.KedifaUpdaterUpdateCertificateTest) ... ok
test_cert_fetch_nomaster_fallback (kedifa.test.KedifaUpdaterUpdateCertificateTest) ... ok
test_cert_fetch_nomaster_nofallback (kedifa.test.KedifaUpdaterUpdateCertificateTest) ... ok
test_cert_nofetch_master_fallback (kedifa.test.KedifaUpdaterUpdateCertificateTest) ... ok
test_cert_nofetch_master_fallback_overridden (kedifa.test.KedifaUpdaterUpdateCertificateTest) ... ok
test_cert_nofetch_master_nofallback (kedifa.test.KedifaUpdaterUpdateCertificateTest) ... ok
test_cert_nofetch_nomaster_fallback (kedifa.test.KedifaUpdaterUpdateCertificateTest) ... ok
test_cert_nofetch_nomaster_fallback_overridden (kedifa.test.KedifaUpdaterUpdateCertificateTest) ... ok
test_cert_nofetch_nomaster_nofallback (kedifa.test.KedifaUpdaterUpdateCertificateTest) ... ok
test_nocert_fetch_master_fallback (kedifa.test.KedifaUpdaterUpdateCertificateTest) ... ok
test_nocert_fetch_master_nofallback (kedifa.test.KedifaUpdaterUpdateCertificateTest) ... ok
test_nocert_fetch_nomaster_fallback (kedifa.test.KedifaUpdaterUpdateCertificateTest) ... ok
test_nocert_fetch_nomaster_nofallback (kedifa.test.KedifaUpdaterUpdateCertificateTest) ... ok
test_nocert_nofetch_master_fallback (kedifa.test.KedifaUpdaterUpdateCertificateTest) ... ok
test_nocert_nofetch_master_nofallback (kedifa.test.KedifaUpdaterUpdateCertificateTest) ... ok
test_nocert_nofetch_nomaster_fallback (kedifa.test.KedifaUpdaterUpdateCertificateTest) ... ok
test_nocert_nofetch_nomaster_nofallback (kedifa.test.KedifaUpdaterUpdateCertificateTest) ... ok

======================================================================
ERROR: test_GET_unsigned_identity (kedifa.test.KedifaIntegrationTest)
----------------------------------------------------------------------
Traceback (most recent call last):
File "/srv/slapgrid/slappart9/srv/testnode/bvi/inst/test0-0/parts/kedifa/kedifa/test.py", line 431, in test_GET_unsigned_identity
self.kedifa_url + self.reference, cert=incorrect_key_pem)
File "/srv/slapgrid/slappart9/srv/testnode/bvi/inst/test0-0/parts/kedifa/kedifa/test.py", line 303, in requests_get
return requests.get(verify=self.ca_crt_pem, *args, **kwargs)
File "/srv/slapgrid/slappart9/srv/testnode/bvi/soft/65dbbd3d11daa99cf78c9566a0a4798e/eggs/requests-2.13.0-py2.7.egg/requests/api.py", line 70, in get
return request('get', url, params=params, **kwargs)
File "/srv/slapgrid/slappart9/srv/testnode/bvi/soft/65dbbd3d11daa99cf78c9566a0a4798e/eggs/requests-2.13.0-py2.7.egg/requests/api.py", line 56, in request
return session.request(method=method, url=url, **kwargs)
File "/srv/slapgrid/slappart9/srv/testnode/bvi/soft/65dbbd3d11daa99cf78c9566a0a4798e/eggs/requests-2.13.0-py2.7.egg/requests/sessions.py", line 488, in request
resp = self.send(prep, **send_kwargs)
File "/srv/slapgrid/slappart9/srv/testnode/bvi/soft/65dbbd3d11daa99cf78c9566a0a4798e/eggs/requests-2.13.0-py2.7.egg/requests/sessions.py", line 609, in send
r = adapter.send(request, **kwargs)
File "/srv/slapgrid/slappart9/srv/testnode/bvi/soft/65dbbd3d11daa99cf78c9566a0a4798e/eggs/requests-2.13.0-py2.7.egg/requests/adapters.py", line 423, in send
timeout=timeout
File "/srv/slapgrid/slappart9/srv/testnode/bvi/soft/65dbbd3d11daa99cf78c9566a0a4798e/eggs/requests-2.13.0-py2.7.egg/requests/packages/urllib3/connectionpool.py", line 600, in urlopen
chunked=chunked)
File "/srv/slapgrid/slappart9/srv/testnode/bvi/soft/65dbbd3d11daa99cf78c9566a0a4798e/eggs/requests-2.13.0-py2.7.egg/requests/packages/urllib3/connectionpool.py", line 356, in _make_request
conn.request(method, url, **httplib_request_kw)
File "/srv/slapgrid/slappart9/srv/testnode/bvi/soft/65dbbd3d11daa99cf78c9566a0a4798e/parts/python2.7/lib/python2.7/httplib.py", line 1069, in request
self._send_request(method, url, body, headers)
File "/srv/slapgrid/slappart9/srv/testnode/bvi/soft/65dbbd3d11daa99cf78c9566a0a4798e/parts/python2.7/lib/python2.7/httplib.py", line 1109, in _send_request
self.endheaders(body)
File "/srv/slapgrid/slappart9/srv/testnode/bvi/soft/65dbbd3d11daa99cf78c9566a0a4798e/parts/python2.7/lib/python2.7/httplib.py", line 1065, in endheaders
self._send_output(message_body)
File "/srv/slapgrid/slappart9/srv/testnode/bvi/soft/65dbbd3d11daa99cf78c9566a0a4798e/parts/python2.7/lib/python2.7/httplib.py", line 892, in _send_output
self.send(msg)
File "/srv/slapgrid/slappart9/srv/testnode/bvi/soft/65dbbd3d11daa99cf78c9566a0a4798e/parts/python2.7/lib/python2.7/httplib.py", line 868, in send
self.sock.sendall(data)
File "/srv/slapgrid/slappart9/srv/testnode/bvi/soft/65dbbd3d11daa99cf78c9566a0a4798e/eggs/requests-2.13.0-py2.7.egg/requests/packages/urllib3/contrib/pyopenssl.py", line 311, in sendall
sent = self._send_until_done(data[total_sent:total_sent + SSL_WRITE_BLOCKSIZE])
File "/srv/slapgrid/slappart9/srv/testnode/bvi/soft/65dbbd3d11daa99cf78c9566a0a4798e/eggs/requests-2.13.0-py2.7.egg/requests/packages/urllib3/contrib/pyopenssl.py", line 301, in _send_until_done
return self.connection.send(data)
File "/srv/slapgrid/slappart9/srv/testnode/bvi/soft/65dbbd3d11daa99cf78c9566a0a4798e/eggs/pyOpenSSL-18.0.0-py2.7.egg/OpenSSL/SSL.py", line 1729, in send
self._raise_ssl_error(self._ssl, result)
File "/srv/slapgrid/slappart9/srv/testnode/bvi/soft/65dbbd3d11daa99cf78c9566a0a4798e/eggs/pyOpenSSL-18.0.0-py2.7.egg/OpenSSL/SSL.py", line 1631, in _raise_ssl_error
raise SysCallError(errno, errorcode.get(errno))
SysCallError: (104, 'ECONNRESET')

----------------------------------------------------------------------
Ran 76 tests in 73.063s

FAILED (errors=1, skipped=1)
Test failed: <unittest.runner.TextTestResult run=76 errors=1 failures=0>
error: Test failed: <unittest.runner.TextTestResult run=76 errors=1 failures=0>