VIFIB DESCENTRALIZED CLOUD COMPUTING

SlapOS is a decentralized Cloud Computing technology that can automate the deployment and configuration of applications in a heterogeneous environment.
seleniumserver
5 403.248
27
1
0
1
FAILED
Completed
/srv/slapgrid/slappart15/srv/testnode/byx/soft/2b86aab70018dbe4d6ab37211a35efe8/bin/python_for_test setup.py test
running test
running egg_info
writing requirements to slapos.test.seleniumserver.egg-info/requires.txt
writing slapos.test.seleniumserver.egg-info/PKG-INFO
writing top-level names to slapos.test.seleniumserver.egg-info/top_level.txt
writing dependency_links to slapos.test.seleniumserver.egg-info/dependency_links.txt
reading manifest file 'slapos.test.seleniumserver.egg-info/SOURCES.txt'
writing manifest file 'slapos.test.seleniumserver.egg-info/SOURCES.txt'
running build_ext
No handlers could be found for logger "erp5.util.testnode"
test_chrome (test.TestBrowserSelection) ... ok
test_firefox (test.TestBrowserSelection) ... ok
test_firefox_desired_version (test.TestBrowserSelection) ... ok
test_multiple_clients (test.TestChrome69) ... ok
test_resize_window (test.TestChrome69) ... ok
test_screenshot (test.TestChrome69) ... ok
test_simple_submit_scenario (test.TestChrome69) ... ok
test_upload_file (test.TestChrome69) ... ok
test_user_agent (test.TestChrome69) ... ok
test_window_and_screen_size (test.TestChrome69) ... ok
test_multiple_clients (test.TestFirefox52) ... ok
test_resize_window (test.TestFirefox52) ... expected failure
test_screenshot (test.TestFirefox52) ... ok
test_simple_submit_scenario (test.TestFirefox52) ... ok
test_upload_file (test.TestFirefox52) ... ok
test_user_agent (test.TestFirefox52) ... ok
test_window_and_screen_size (test.TestFirefox52) ... ok
test_multiple_clients (test.TestFirefox60) ... ok
test_resize_window (test.TestFirefox60) ... ok
test_screenshot (test.TestFirefox60) ... ok
test_simple_submit_scenario (test.TestFirefox60) ... ok
test_upload_file (test.TestFirefox60) ... ok
test_user_agent (test.TestFirefox60) ... ok
test_window_and_screen_size (test.TestFirefox60) ... ok
test_admin (test.TestFrontend) ... ok
test_browser_use_hub (test.TestFrontend) ... ok
test_connect (test.TestSSHServer) ... FAIL

======================================================================
FAIL: test_connect (test.TestSSHServer)
----------------------------------------------------------------------
Traceback (most recent call last):
File "/srv/slapgrid/slappart15/srv/testnode/byx/soft/2b86aab70018dbe4d6ab37211a35efe8/parts/slapos-repository/software/seleniumserver/test/test.py", line 388, in test_connect
self.assertIn("Welcome to SlapOS Selenium Server.", channel.recv(100))
AssertionError: 'Welcome to SlapOS Selenium Server.' not found in 'Attempt to write login records by non-root user (aborting)\r\r\n\r\n'

----------------------------------------------------------------------
Ran 27 tests in 5403.248s

FAILED (failures=1, expected failures=1)
Test failed: <unittest.runner.TextTestResult run=27 errors=0 failures=1>
error: Test failed: <unittest.runner.TextTestResult run=27 errors=0 failures=1>