VIFIB DESCENTRALIZED CLOUD COMPUTING

SlapOS is a decentralized Cloud Computing technology that can automate the deployment and configuration of applications in a heterogeneous environment.
standalone-shared
0.006
7
1
5
1
FAILED
Completed
/srv/slapgrid/slappart19/srv/testnode/boj/soft/6092df74c9482ef940b7c6c71acaaba0/bin/runTestSuite_py setup.py test
running test
Searching for requests
Best match: requests 2.19.1
Processing requests-2.19.1-py2.7.egg

Using /srv/slapgrid/slappart19/srv/testnode/boj/soft/6092df74c9482ef940b7c6c71acaaba0/parts/slapos-package/playbook/roles/standalone-shared/.eggs/requests-2.19.1-py2.7.egg
Searching for certifi>=2017.4.17
Best match: certifi 2018.8.24
Processing certifi-2018.8.24-py2.7.egg

Using /srv/slapgrid/slappart19/srv/testnode/boj/soft/6092df74c9482ef940b7c6c71acaaba0/parts/slapos-package/playbook/roles/standalone-shared/.eggs/certifi-2018.8.24-py2.7.egg
Searching for urllib3<1.24,>=1.21.1
Best match: urllib3 1.23
Processing urllib3-1.23-py2.7.egg

Using /srv/slapgrid/slappart19/srv/testnode/boj/soft/6092df74c9482ef940b7c6c71acaaba0/parts/slapos-package/playbook/roles/standalone-shared/.eggs/urllib3-1.23-py2.7.egg
Searching for idna<2.8,>=2.5
Best match: idna 2.7
Processing idna-2.7-py2.7.egg

Using /srv/slapgrid/slappart19/srv/testnode/boj/soft/6092df74c9482ef940b7c6c71acaaba0/parts/slapos-package/playbook/roles/standalone-shared/.eggs/idna-2.7-py2.7.egg
Searching for chardet<3.1.0,>=3.0.2
Best match: chardet 3.0.4
Processing chardet-3.0.4-py2.7.egg

Using /srv/slapgrid/slappart19/srv/testnode/boj/soft/6092df74c9482ef940b7c6c71acaaba0/parts/slapos-package/playbook/roles/standalone-shared/.eggs/chardet-3.0.4-py2.7.egg
running egg_info
writing standalone_shared_tests.egg-info/PKG-INFO
writing top-level names to standalone_shared_tests.egg-info/top_level.txt
writing dependency_links to standalone_shared_tests.egg-info/dependency_links.txt
reading manifest file 'standalone_shared_tests.egg-info/SOURCES.txt'
writing manifest file 'standalone_shared_tests.egg-info/SOURCES.txt'
running build_ext
Standard output:
Try 3600/3600: Test timed out and no result found.
Standard error:
test_https_erp5 (tests.testSiteHttps.TestSiteHttps)
Check that accessing site over HTTPS redirects to login_form ... ERROR
test_https_erp5_anydomain (tests.testSiteHttps.TestSiteHttps)
HTTPS: Checks that any domain can be used ... skipped 'Currently HTTPS will reply with "Hostname 172.16.0.9 provided via SNI and hostname anyhost provided via HTTP are different"'
test_https_erp5_login_form (tests.testSiteHttps.TestSiteHttps)
Check that accessing login_form over HTTPS works ... ERROR
test_build (tests.testSiteStatus.TestSiteStatus)
Checks that site was correctly created ... ERROR
test_build_time (tests.testSiteStatus.TestSiteStatus)
Asserts that site was built in less than 9h ... FAIL
test_http_erp5_anydomain (tests.testSiteHttp.TestSiteHttp)
Checks that any domain can be used ... ERROR
test_http_erp5_login_form (tests.testSiteHttp.TestSiteHttp)
Check that accessing site over HTTP redirects to HTTPS ... ERROR

======================================================================
ERROR: test_https_erp5 (tests.testSiteHttps.TestSiteHttps)
Check that accessing site over HTTPS redirects to login_form
----------------------------------------------------------------------
Traceback (most recent call last):
File "/srv/slapgrid/slappart19/srv/testnode/boj/soft/6092df74c9482ef940b7c6c71acaaba0/parts/slapos-package/playbook/roles/standalone-shared/tests/testSiteHttps.py", line 36, in test_https_erp5
self.https_url + '/erp5/', verify=False, allow_redirects=False)
File "/srv/slapgrid/slappart19/srv/testnode/boj/soft/6092df74c9482ef940b7c6c71acaaba0/parts/slapos-package/playbook/roles/standalone-shared/.eggs/requests-2.19.1-py2.7.egg/requests/api.py", line 72, in get
return request('get', url, params=params, **kwargs)
File "/srv/slapgrid/slappart19/srv/testnode/boj/soft/6092df74c9482ef940b7c6c71acaaba0/parts/slapos-package/playbook/roles/standalone-shared/.eggs/requests-2.19.1-py2.7.egg/requests/api.py", line 58, in request
return session.request(method=method, url=url, **kwargs)
File "/srv/slapgrid/slappart19/srv/testnode/boj/soft/6092df74c9482ef940b7c6c71acaaba0/parts/slapos-package/playbook/roles/standalone-shared/.eggs/requests-2.19.1-py2.7.egg/requests/sessions.py", line 512, in request
resp = self.send(prep, **send_kwargs)
File "/srv/slapgrid/slappart19/srv/testnode/boj/soft/6092df74c9482ef940b7c6c71acaaba0/parts/slapos-package/playbook/roles/standalone-shared/.eggs/requests-2.19.1-py2.7.egg/requests/sessions.py", line 622, in send
r = adapter.send(request, **kwargs)
File "/srv/slapgrid/slappart19/srv/testnode/boj/soft/6092df74c9482ef940b7c6c71acaaba0/parts/slapos-package/playbook/roles/standalone-shared/.eggs/requests-2.19.1-py2.7.egg/requests/adapters.py", line 513, in send
raise ConnectionError(e, request=request)
ConnectionError: HTTPSConnectionPool(host='10.0.91.35', port=10443): Max retries exceeded with url: /erp5/ (Caused by NewConnectionError('<urllib3.connection.VerifiedHTTPSConnection object at 0x7f342b532810>: Failed to establish a new connection: [Errno 111] Connection refused',))

======================================================================
ERROR: test_https_erp5_login_form (tests.testSiteHttps.TestSiteHttps)
Check that accessing login_form over HTTPS works
----------------------------------------------------------------------
Traceback (most recent call last):
File "/srv/slapgrid/slappart19/srv/testnode/boj/soft/6092df74c9482ef940b7c6c71acaaba0/parts/slapos-package/playbook/roles/standalone-shared/tests/testSiteHttps.py", line 15, in test_https_erp5_login_form
result = requests.get(self.https_url + '/erp5/login_form', verify=False)
File "/srv/slapgrid/slappart19/srv/testnode/boj/soft/6092df74c9482ef940b7c6c71acaaba0/parts/slapos-package/playbook/roles/standalone-shared/.eggs/requests-2.19.1-py2.7.egg/requests/api.py", line 72, in get
return request('get', url, params=params, **kwargs)
File "/srv/slapgrid/slappart19/srv/testnode/boj/soft/6092df74c9482ef940b7c6c71acaaba0/parts/slapos-package/playbook/roles/standalone-shared/.eggs/requests-2.19.1-py2.7.egg/requests/api.py", line 58, in request
return session.request(method=method, url=url, **kwargs)
File "/srv/slapgrid/slappart19/srv/testnode/boj/soft/6092df74c9482ef940b7c6c71acaaba0/parts/slapos-package/playbook/roles/standalone-shared/.eggs/requests-2.19.1-py2.7.egg/requests/sessions.py", line 512, in request
resp = self.send(prep, **send_kwargs)
File "/srv/slapgrid/slappart19/srv/testnode/boj/soft/6092df74c9482ef940b7c6c71acaaba0/parts/slapos-package/playbook/roles/standalone-shared/.eggs/requests-2.19.1-py2.7.egg/requests/sessions.py", line 622, in send
r = adapter.send(request, **kwargs)
File "/srv/slapgrid/slappart19/srv/testnode/boj/soft/6092df74c9482ef940b7c6c71acaaba0/parts/slapos-package/playbook/roles/standalone-shared/.eggs/requests-2.19.1-py2.7.egg/requests/adapters.py", line 513, in send
raise ConnectionError(e, request=request)
ConnectionError: HTTPSConnectionPool(host='10.0.91.35', port=10443): Max retries exceeded with url: /erp5/login_form (Caused by NewConnectionError('<urllib3.connection.VerifiedHTTPSConnection object at 0x7f342b489650>: Failed to establish a new connection: [Errno 111] Connection refused',))

======================================================================
ERROR: test_build (tests.testSiteStatus.TestSiteStatus)
Checks that site was correctly created
----------------------------------------------------------------------
Traceback (most recent call last):
File "/srv/slapgrid/slappart19/srv/testnode/boj/soft/6092df74c9482ef940b7c6c71acaaba0/parts/slapos-package/playbook/roles/standalone-shared/tests/testSiteStatus.py", line 18, in test_build
print self.status_dict['stderr'].encode('utf-8')
KeyError: 'stderr'

======================================================================
ERROR: test_http_erp5_anydomain (tests.testSiteHttp.TestSiteHttp)
Checks that any domain can be used
----------------------------------------------------------------------
Traceback (most recent call last):
File "/srv/slapgrid/slappart19/srv/testnode/boj/soft/6092df74c9482ef940b7c6c71acaaba0/parts/slapos-package/playbook/roles/standalone-shared/tests/testSiteHttp.py", line 42, in test_http_erp5_anydomain
headers={'Host': 'anyhost'}
File "/srv/slapgrid/slappart19/srv/testnode/boj/soft/6092df74c9482ef940b7c6c71acaaba0/parts/slapos-package/playbook/roles/standalone-shared/.eggs/requests-2.19.1-py2.7.egg/requests/api.py", line 72, in get
return request('get', url, params=params, **kwargs)
File "/srv/slapgrid/slappart19/srv/testnode/boj/soft/6092df74c9482ef940b7c6c71acaaba0/parts/slapos-package/playbook/roles/standalone-shared/.eggs/requests-2.19.1-py2.7.egg/requests/api.py", line 58, in request
return session.request(method=method, url=url, **kwargs)
File "/srv/slapgrid/slappart19/srv/testnode/boj/soft/6092df74c9482ef940b7c6c71acaaba0/parts/slapos-package/playbook/roles/standalone-shared/.eggs/requests-2.19.1-py2.7.egg/requests/sessions.py", line 512, in request
resp = self.send(prep, **send_kwargs)
File "/srv/slapgrid/slappart19/srv/testnode/boj/soft/6092df74c9482ef940b7c6c71acaaba0/parts/slapos-package/playbook/roles/standalone-shared/.eggs/requests-2.19.1-py2.7.egg/requests/sessions.py", line 622, in send
r = adapter.send(request, **kwargs)
File "/srv/slapgrid/slappart19/srv/testnode/boj/soft/6092df74c9482ef940b7c6c71acaaba0/parts/slapos-package/playbook/roles/standalone-shared/.eggs/requests-2.19.1-py2.7.egg/requests/adapters.py", line 513, in send
raise ConnectionError(e, request=request)
ConnectionError: HTTPConnectionPool(host='10.0.91.35', port=10080): Max retries exceeded with url: /erp5/ (Caused by NewConnectionError('<urllib3.connection.HTTPConnection object at 0x7f342b4897d0>: Failed to establish a new connection: [Errno 111] Connection refused',))

======================================================================
ERROR: test_http_erp5_login_form (tests.testSiteHttp.TestSiteHttp)
Check that accessing site over HTTP redirects to HTTPS
----------------------------------------------------------------------
Traceback (most recent call last):
File "/srv/slapgrid/slappart19/srv/testnode/boj/soft/6092df74c9482ef940b7c6c71acaaba0/parts/slapos-package/playbook/roles/standalone-shared/tests/testSiteHttp.py", line 19, in test_http_erp5_login_form
allow_redirects=False)
File "/srv/slapgrid/slappart19/srv/testnode/boj/soft/6092df74c9482ef940b7c6c71acaaba0/parts/slapos-package/playbook/roles/standalone-shared/.eggs/requests-2.19.1-py2.7.egg/requests/api.py", line 72, in get
return request('get', url, params=params, **kwargs)
File "/srv/slapgrid/slappart19/srv/testnode/boj/soft/6092df74c9482ef940b7c6c71acaaba0/parts/slapos-package/playbook/roles/standalone-shared/.eggs/requests-2.19.1-py2.7.egg/requests/api.py", line 58, in request
return session.request(method=method, url=url, **kwargs)
File "/srv/slapgrid/slappart19/srv/testnode/boj/soft/6092df74c9482ef940b7c6c71acaaba0/parts/slapos-package/playbook/roles/standalone-shared/.eggs/requests-2.19.1-py2.7.egg/requests/sessions.py", line 512, in request
resp = self.send(prep, **send_kwargs)
File "/srv/slapgrid/slappart19/srv/testnode/boj/soft/6092df74c9482ef940b7c6c71acaaba0/parts/slapos-package/playbook/roles/standalone-shared/.eggs/requests-2.19.1-py2.7.egg/requests/sessions.py", line 622, in send
r = adapter.send(request, **kwargs)
File "/srv/slapgrid/slappart19/srv/testnode/boj/soft/6092df74c9482ef940b7c6c71acaaba0/parts/slapos-package/playbook/roles/standalone-shared/.eggs/requests-2.19.1-py2.7.egg/requests/adapters.py", line 513, in send
raise ConnectionError(e, request=request)
ConnectionError: HTTPConnectionPool(host='10.0.91.35', port=10080): Max retries exceeded with url: /erp5/login_form (Caused by NewConnectionError('<urllib3.connection.HTTPConnection object at 0x7f342b489b10>: Failed to establish a new connection: [Errno 111] Connection refused',))

======================================================================
FAIL: test_build_time (tests.testSiteStatus.TestSiteStatus)
Asserts that site was built in less than 9h
----------------------------------------------------------------------
Traceback (most recent call last):
File "/srv/slapgrid/slappart19/srv/testnode/boj/soft/6092df74c9482ef940b7c6c71acaaba0/parts/slapos-package/playbook/roles/standalone-shared/tests/testSiteStatus.py", line 24, in test_build_time
self.assertLess(self.status_dict['duration'], (3600. * 9))
AssertionError: 36025.562417030334 not less than 32400.0

----------------------------------------------------------------------
Ran 7 tests in 0.006s

FAILED (failures=1, errors=5, skipped=1)
Test failed: <unittest.runner.TextTestResult run=7 errors=5 failures=1>
error: Test failed: <unittest.runner.TextTestResult run=7 errors=5 failures=1>