VIFIB DESCENTRALIZED CLOUD COMPUTING

SlapOS is a decentralized Cloud Computing technology that can automate the deployment and configuration of applications in a heterogeneous environment.
slapos.toolbox
122.872
126
2
0
3
FAILED
Completed
/srv/slapgrid/slappart6/srv/testnode/ij/soft/0649a91b2feb3b2a466bc416c6c4fe04/bin/python_for_test setup.py test
running test
running egg_info
creating slapos.toolbox.egg-info
writing requirements to slapos.toolbox.egg-info/requires.txt
writing slapos.toolbox.egg-info/PKG-INFO
writing namespace_packages to slapos.toolbox.egg-info/namespace_packages.txt
writing top-level names to slapos.toolbox.egg-info/top_level.txt
writing dependency_links to slapos.toolbox.egg-info/dependency_links.txt
writing entry points to slapos.toolbox.egg-info/entry_points.txt
writing manifest file 'slapos.toolbox.egg-info/SOURCES.txt'
reading manifest file 'slapos.toolbox.egg-info/SOURCES.txt'
reading manifest template 'MANIFEST.in'
writing manifest file 'slapos.toolbox.egg-info/SOURCES.txt'
running build_ext
SUCCESS: bootstrap is OK
SUCCESS: bootstrap is OK
SUCCESS: bootstrap is OK
SUCCESS: bootstrap is OK
SUCCESS: bootstrap is OK
{"result": {"date": "2018-10-11T08:21:46", "failed": false, "message": "success", "type": "Test Result"}, "path": "/tmp/tmppVEGDo/etc/plugin/my_promise.py", "name": "my_promise.py", "execution-time": 0.1, "title": "my_promise"}ERROR: Json file at https://sub.monitor.test.com/share/public//monitor.global.json is not valid
ERROR: Json file at https://sub2.monitor.test.com/share/public//monitor.global.json is not valid
restarted
restarted
restarted
/tmp/tmpFFmJih/content wjkqelod
/tmp/tmprckMjA/content wjkqelod
/tmp/tmprckMjA/content changed.value
/tmp/tmprckMjA/content changed.value new.domain.com
/tmp/tmpjXuwCD/content wjkqelod
Setting VNC password...
Done.
Adding 2 CPUs...
Done.
Adding 2 CPUs...
Done.
Hotplug CPU is up to date.
Request remove 1 CPUs...
Device cpu2 was removed.
Done.
Adding 2 memory slot(s) of 1024 MB...
Done.
Removing 2048 MB of memory...
Trying to remove devices dimm3, mem3...
Device dimm3 was removed.
Device mem3 was removed.
Trying to remove devices dimm2, mem2...
Device dimm2 was removed.
Device mem2 was removed.
Done.
Removing 3072 MB of memory...
Trying to remove devices dimm3, mem3...
Device dimm3 was removed.
Device mem3 was removed.
Trying to remove devices dimm2, mem2...
Device dimm2 was removed.
Device mem2 was removed.
Trying to remove devices dimm1, mem1...
Device dimm1 was removed.
Device mem1 was removed.
Done.
Adding 1 memory slot(s) of 1024 MB...
Done.
Hotplug Memory size is up to date.
Removing 2048 MB of memory...
Trying to remove devices dimm3, mem3...
Stopping the VM...
Trying hard shutdown of the VM...
-rw-r--r-- 1 slapuser6 slapuser6 19 Oct 11 10:22 /tmp/tmpUwrnkW/.slappart0_monitor.boostrap.log
-rw-r--r-- 1 slapuser6 slapuser6 19 Oct 11 10:22 /tmp/tmp4ZSAE_/.slappart0_monitor.boostrap.log
-rw-r--r-- 1 slapuser6 slapuser6 19 Oct 11 10:22 /tmp/tmpv9wQBm/.slappart0_monitor.boostrap.log
PING host=127.0.0.1 code=200, result=0.032, packet_lost_ratio=0 msg=min 6 max 0.036 avg 0.032
PING6 host=2001:67c:1254::1 code=200, result=2.653, packet_lost_ratio=0 msg=min 5 max 2.754 avg 2.653
Fail 1.0352 (latency4) > 2.653 (latence6)
PING host=couscous code=600, result=failed, packet_lost_ratio=-1 msg=Fail to parser ping output
PING6 host=::1 code=200, result=0.052, packet_lost_ratio=0 msg=min 0 max 0.062 avg 0.052
PING host=127.0.0.1 code=200, result=0.036, packet_lost_ratio=0 msg=min 2 max 0.044 avg 0.036
PING6 host=couscous code=600, result=failed, packet_lost_ratio=-1 msg=Fail to parser ping output
PING host=8.8.8.8 code=600, result=failed, packet_lost_ratio=100 msg=Cannot ping host
PING6 host=::1 code=200, result=0.050, packet_lost_ratio=0 msg=min 2 max 0.065 avg 0.050
test_complexCommand (slapos.test.test_apachedex.TestApachedexCommand) ... ok
test_raiseErro (slapos.test.test_apachedex.TestApachedexCommand) ... ok
test_simpleCommand (slapos.test.test_apachedex.TestApachedexCommand) ... ok
test_autostemp (slapos.test.test_agent.TestAutoSTemp)
Test AutoSTemp creates the file with content and ... ok
test_cleanup_empty_group (slapos.test.test_agent.TestTestMap)
Check available group of tests ... ok
test_dropgroup (slapos.test.test_agent.TestTestMap)
Check available group of tests ... ok
test_getexcludelist (slapos.test.test_agent.TestTestMap)
Check available group of tests ... ok
test_getnextgroup (slapos.test.test_agent.TestTestMap)
Get Next Group ... ok
test_group (slapos.test.test_agent.TestTestMap)
Check available group of tests ... ok
test_dnsbench_fail (slapos.test.test_networkbench.TestDNSBench)
Test dns failure resolution ... ok
test_dnsbench_ok (slapos.test.test_networkbench.TestDNSBench)
Test dns resolution, this test may fail if ... FAIL
test_dnsbench_unexpected (slapos.test.test_networkbench.TestDNSBench)
Test dns unexpected resolution ... ok
test_request_expected_redirection (slapos.test.test_networkbench.TestHTTPBench)
This test is way to badly written as it depends on ... ok
test_request_expected_response (slapos.test.test_networkbench.TestHTTPBench)
This test is way to badly written as it depends on ... ok
test_request_expected_text (slapos.test.test_networkbench.TestHTTPBench)
This test is way to badly written as it depends on ... ok
test_request_fail (slapos.test.test_networkbench.TestHTTPBench)
Test unreachable URL ... Traceback (most recent call last):
File "/srv/slapgrid/slappart6/srv/testnode/ij/inst/test0-0/parts/slapos.toolbox/slapos/networkbench/http.py", line 15, in get_curl
curl.perform()
error: (6, 'Could not resolve host: thisurldontexist.erp5.com')
ok
test_request_ok (slapos.test.test_networkbench.TestHTTPBench)
This test is way to badly written as it depends on ... ok
test_request_unexpected_response (slapos.test.test_networkbench.TestHTTPBench)
This test is way to badly written as it depends on ... ok
test_request_unexpected_text (slapos.test.test_networkbench.TestHTTPBench)
This test is way to badly written as it depends on ... ok
test_ping6_fail (slapos.test.test_networkbench.TestPing) ... ok
test_ping6_ok (slapos.test.test_networkbench.TestPing) ... ok
test_ping_fail (slapos.test.test_networkbench.TestPing) ... ok
test_ping_ok (slapos.test.test_networkbench.TestPing) ... ok
test_getPartitionCPULoadAverage (slapos.test.monitor.test_monitor_collect.TestMonitorCollect) ... ok
test_getPartitionComsumptionStatus (slapos.test.monitor.test_monitor_collect.TestMonitorCollect) ... ok
test_getPartitionConsumption (slapos.test.monitor.test_monitor_collect.TestMonitorCollect) ... ok
test_getPartitionDiskUsedAverage (slapos.test.monitor.test_monitor_collect.TestMonitorCollect) ... ok
test_getPartitionUsedMemoryAverage (slapos.test.monitor.test_monitor_collect.TestMonitorCollect) ... ok
test_monitor_bootstrap_check_folder (slapos.test.monitor.testbootstrap.MonitorBootstrapTest) ... ok
test_monitor_bootstrap_empty (slapos.test.monitor.testbootstrap.MonitorBootstrapTest) ... ok
test_monitor_bootstrap_genconfig (slapos.test.monitor.testbootstrap.MonitorBootstrapTest) ... ok
test_monitor_bootstrap_promises (slapos.test.monitor.testbootstrap.MonitorBootstrapTest) ... ok
test_promise_NOK (slapos.test.monitor.testrunpromise.MonitorPromiseTest) ... 2018-10-11 10:21:46,364 - Monitor - INFO - Checking promises...
2018-10-11 10:21:46,364 - Monitor - INFO - Checking promise promise_1...
2018-10-11 10:21:46,468 - Monitor - ERROR - failed
2018-10-11 10:21:46,469 - Monitor - INFO - Finished promises.
2018-10-11 10:21:46,471 - Monitor - INFO - Checking promises...
2018-10-11 10:21:46,471 - Monitor - INFO - Checking promise promise_1...
2018-10-11 10:21:46,475 - Monitor - ERROR - failed
2018-10-11 10:21:46,475 - Monitor - INFO - Finished promises.
ok
test_promise_OK (slapos.test.monitor.testrunpromise.MonitorPromiseTest) ... 2018-10-11 10:21:46,479 - Monitor - INFO - Checking promises...
2018-10-11 10:21:46,480 - Monitor - INFO - Checking promise promise_1...
2018-10-11 10:21:46,584 - Monitor - INFO - Finished promises.
2018-10-11 10:21:46,587 - Monitor - INFO - Checking promises...
2018-10-11 10:21:46,587 - Monitor - INFO - Checking promise promise_1...
2018-10-11 10:21:46,691 - Monitor - INFO - Finished promises.
ok
test_promise_generic (slapos.test.monitor.testrunpromise.MonitorPromiseTest) ... 2018-10-11 10:21:46,697 - Monitor - INFO - Checking promises...
2018-10-11 10:21:46,697 - Monitor - INFO - Checking promise my_promise.py...
2018-10-11 10:21:46,802 - Monitor - INFO - Checking promise my_second_promise.py...
2018-10-11 10:21:46,907 - Monitor - INFO - Finished promises.
ok
test_promise_generic_failed (slapos.test.monitor.testrunpromise.MonitorPromiseTest) ... 2018-10-11 10:21:46,918 - Monitor - INFO - Checking promises...
2018-10-11 10:21:46,918 - Monitor - INFO - Checking promise my_promise.py...
2018-10-11 10:21:47,021 - Monitor - ERROR - failed
2018-10-11 10:21:47,022 - Monitor - INFO - Finished promises.
ok
test_promise_generic_periodicity (slapos.test.monitor.testrunpromise.MonitorPromiseTest) ... 2018-10-11 10:21:47,027 - Monitor - INFO - Checking promises...
2018-10-11 10:21:47,028 - Monitor - INFO - Checking promise my_promise.py...
2018-10-11 10:21:47,132 - Monitor - ERROR - failed
2018-10-11 10:21:47,132 - Monitor - INFO - Finished promises.
2018-10-11 10:21:47,134 - Monitor - INFO - Checking promises...
2018-10-11 10:21:47,134 - Monitor - INFO - Checking promise my_promise.py...
2018-10-11 10:21:47,135 - Monitor - INFO - Finished promises.
2018-10-11 10:21:49,138 - Monitor - INFO - Checking promises...
2018-10-11 10:21:49,139 - Monitor - INFO - Checking promise my_promise.py...
2018-10-11 10:21:49,243 - Monitor - ERROR - failed
2018-10-11 10:21:49,243 - Monitor - INFO - Finished promises.
ok
test_promise_generic_run_only (slapos.test.monitor.testrunpromise.MonitorPromiseTest) ... 2018-10-11 10:21:49,248 - Monitor - INFO - Checking promises...
2018-10-11 10:21:49,248 - Monitor - INFO - Checking promise my_promise.py...
2018-10-11 10:21:49,352 - Monitor - ERROR - failed
2018-10-11 10:21:49,353 - Monitor - INFO - Checking promise my_second_promise.py...
2018-10-11 10:21:49,457 - Monitor - ERROR - failed
2018-10-11 10:21:49,457 - Monitor - INFO - Finished promises.
2018-10-11 10:21:49,460 - Monitor - INFO - Checking promises...
2018-10-11 10:21:49,461 - Monitor - INFO - Checking promise my_second_promise.py...
2018-10-11 10:22:09,568 - Monitor - ERROR - Error: Promise timed out after 20 seconds
2018-10-11 10:22:09,569 - Monitor - INFO - Finished promises.
ok
test_promise_generic_status_change (slapos.test.monitor.testrunpromise.MonitorPromiseTest) ... 2018-10-11 10:22:10,130 - Monitor - INFO - Checking promises...
2018-10-11 10:22:10,130 - Monitor - INFO - Checking promise my_promise.py...
2018-10-11 10:22:10,234 - Monitor - ERROR - failed
2018-10-11 10:22:10,234 - Monitor - INFO - Finished promises.
2018-10-11 10:22:12,244 - Monitor - INFO - Checking promises...
2018-10-11 10:22:12,245 - Monitor - INFO - Checking promise my_promise.py...
2018-10-11 10:22:12,349 - Monitor - INFO - Finished promises.
ok
test_promise_mixed (slapos.test.monitor.testrunpromise.MonitorPromiseTest) ... 2018-10-11 10:22:12,353 - Monitor - INFO - Checking promises...
2018-10-11 10:22:12,353 - Monitor - INFO - Checking promise promise_1...
2018-10-11 10:22:12,457 - Monitor - INFO - Finished promises.
2018-10-11 10:22:13,462 - Monitor - INFO - Checking promises...
2018-10-11 10:22:13,462 - Monitor - INFO - Checking promise promise_1...
2018-10-11 10:22:13,567 - Monitor - ERROR - failed
2018-10-11 10:22:13,567 - Monitor - INFO - Finished promises.
ok
test_promise_two_folder (slapos.test.monitor.testrunpromise.MonitorPromiseTest) ... 2018-10-11 10:22:13,574 - Monitor - INFO - Checking promises...
2018-10-11 10:22:13,575 - Monitor - INFO - Checking promise promise_2...
2018-10-11 10:22:13,679 - Monitor - INFO - Checking promise promise_1...
2018-10-11 10:22:13,783 - Monitor - INFO - Finished promises.
ok
test_monitor_instance_state (slapos.test.monitor.testglobalstate.MonitorGlobalTest) ... 2018-10-11 10:22:15,369 - Monitor - INFO - Checking promises...
2018-10-11 10:22:15,370 - Monitor - INFO - Checking promise promise_2...
2018-10-11 10:22:15,474 - Monitor - ERROR - error
2018-10-11 10:22:15,475 - Monitor - INFO - Checking promise promise_1...
2018-10-11 10:22:15,579 - Monitor - INFO - Checking promise promise_4...
2018-10-11 10:22:15,684 - Monitor - INFO - Checking promise promise_3...
2018-10-11 10:22:15,789 - Monitor - ERROR - error
2018-10-11 10:22:15,790 - Monitor - INFO - Finished promises.
2018-10-11 10:22:15,797 - Monitor - INFO - Checking promises...
2018-10-11 10:22:15,798 - Monitor - INFO - Checking promise promise_2...
2018-10-11 10:22:15,902 - Monitor - INFO - Checking promise promise_1...
2018-10-11 10:22:16,007 - Monitor - INFO - Checking promise promise_4...
2018-10-11 10:22:16,112 - Monitor - INFO - Checking promise promise_3...
2018-10-11 10:22:16,218 - Monitor - INFO - Finished promises.
ok
test_write_config_default (slapos.test.monitor.test_config_document.MonitorConfigDocument) ... ok
test_write_config_edit_values (slapos.test.monitor.test_config_document.MonitorConfigDocument) ... ok
test_write_config_parts (slapos.test.monitor.test_config_document.MonitorConfigDocument) ... ok
test_ifKOFoundErrorReturned (slapos.test.test_checkfeedaspromise.TestCheckFeedAsPromise) ... ok
test_ifNoOKPatternFoundErrorIsRaised (slapos.test.test_checkfeedaspromise.TestCheckFeedAsPromise) ... ok
test_ifOKFoundNoErrorReturned (slapos.test.test_checkfeedaspromise.TestCheckFeedAsPromise) ... ok
test_noItemInTheFeedIsNotAnError (slapos.test.test_checkfeedaspromise.TestCheckFeedAsPromise) ... ok
test_generatedRSSIsCorrect (slapos.test.test_rdiffBackupStat2RSS.TestRdiffBackupStat2RSS) ... ok
test_sublist (slapos.test.test_systool.TestSystool) ... ok
test_feedItemsAreSortedByDate (slapos.test.test_generatefeed.TestGenerateFeed) ... ok
test_generateFeedCleanStatusDirectoryIfTooManyItems (slapos.test.test_generatefeed.TestGenerateFeed) ... ok
test_secure_remove_file (slapos.test.test_securedelete.TestSecureDelete) ... ok
test_secure_remove_file_check_exist (slapos.test.test_securedelete.TestSecureDelete) ... ok
test_secure_remove_file_check_exist_false (slapos.test.test_securedelete.TestSecureDelete) ... ok
test_secure_remove_file_keep_file (slapos.test.test_securedelete.TestSecureDelete) ... ok
test_secure_remove_file_multiple_files (slapos.test.test_securedelete.TestSecureDelete) ... ok
test_secure_remove_file_non_zero (slapos.test.test_securedelete.TestSecureDelete) ... ok
test_secure_remove_file_with_link (slapos.test.test_securedelete.TestSecureDelete) ... ok
test_setVNCPassword (slapos.test.test_qemuqmpclient.TestQemuQMPWrapper) ... ok
test_updateDevice_cpu_add (slapos.test.test_qemuqmpclient.TestQemuQMPWrapper) ... ok
test_updateDevice_cpu_increase (slapos.test.test_qemuqmpclient.TestQemuQMPWrapper) ... ok
test_updateDevice_cpu_no_update (slapos.test.test_qemuqmpclient.TestQemuQMPWrapper) ... ok
test_updateDevice_cpu_remove (slapos.test.test_qemuqmpclient.TestQemuQMPWrapper) ... ok
test_updateDevice_memory_add (slapos.test.test_qemuqmpclient.TestQemuQMPWrapper) ... ok
test_updateDevice_memory_delete (slapos.test.test_qemuqmpclient.TestQemuQMPWrapper) ... ok
test_updateDevice_memory_delete_all (slapos.test.test_qemuqmpclient.TestQemuQMPWrapper) ... ok
test_updateDevice_memory_increase (slapos.test.test_qemuqmpclient.TestQemuQMPWrapper) ... ok
test_updateDevice_memory_no_update (slapos.test.test_qemuqmpclient.TestQemuQMPWrapper) ... ok
test_updateDevice_memory_will_reboot (slapos.test.test_qemuqmpclient.TestQemuQMPWrapper) ... ok
test_check_free_disk_with_unavailable_dates (slapos.test.promise.plugin.test_check_free_disk_space.TestCheckFreeDiskSpace) ... 2018-10-11 10:22:42,135 - slapos.grid.promise - INFO - Checking promise check-free-disk-space.py...
ok
test_check_free_disk_with_unicode_string_path (slapos.test.promise.plugin.test_check_free_disk_space.TestCheckFreeDiskSpace) ... 2018-10-11 10:22:42,277 - slapos.grid.promise - INFO - Checking promise check-free-disk-space.py...
ok
test_disk_space_nok (slapos.test.promise.plugin.test_check_free_disk_space.TestCheckFreeDiskSpace) ... 2018-10-11 10:22:42,425 - slapos.grid.promise - INFO - Checking promise check-free-disk-space.py...
2018-10-11 10:22:42,528 - slapos.grid.promise - ERROR - Free disk space low: remaining 269.1 G (threshold: 291921381.0 G)
ok
test_disk_space_ok (slapos.test.promise.plugin.test_check_free_disk_space.TestCheckFreeDiskSpace) ... 2018-10-11 10:22:42,559 - slapos.grid.promise - INFO - Checking promise check-free-disk-space.py...
ok
test_monitor_bootstrap_fail (slapos.test.promise.plugin.test_monitor_bootstrap_status.TestPromiseMonitorBoostrap) ... 2018-10-11 10:22:42,672 - slapos.grid.promise - INFO - Checking promise my-monitor-bootstrap.py...
2018-10-11 10:22:42,778 - slapos.grid.promise - ERROR - Monitor bootstrap exited with error.
---- Latest monitor-boostrap.log ----
Buildout running...
ok
test_monitor_bootstrap_no_run (slapos.test.promise.plugin.test_monitor_bootstrap_status.TestPromiseMonitorBoostrap) ... 2018-10-11 10:22:42,787 - slapos.grid.promise - INFO - Checking promise my-monitor-bootstrap.py...
ok
test_monitor_bootstrap_ok (slapos.test.promise.plugin.test_monitor_bootstrap_status.TestPromiseMonitorBoostrap) ... 2018-10-11 10:22:42,900 - slapos.grid.promise - INFO - Checking promise my-monitor-bootstrap.py...
ok
test_check_cpu_load_run (slapos.test.promise.plugin.test_check_server_cpu_load.TestCheckServerCPULoad) ... 2018-10-11 10:22:43,007 - slapos.grid.promise - INFO - Checking promise server-cpu-load-promise.py...
ok
test_partition_deployment_state_failed (slapos.test.promise.plugin.test_check_partition_deployment_state.TestPartitionDeploymentState) ... 2018-10-11 10:22:43,114 - slapos.grid.promise - INFO - Checking promise partition-deployment-state.py...
2018-10-11 10:22:43,218 - slapos.grid.promise - ERROR - Buildout failed to process slappart0.
ok
test_partition_deployment_state_ok (slapos.test.promise.plugin.test_check_partition_deployment_state.TestPartitionDeploymentState) ... 2018-10-11 10:22:43,221 - slapos.grid.promise - INFO - Checking promise partition-deployment-state.py...
ok
test_fail (slapos.test.promise.test_check_slow_queries_digest_result.TestCheckSlowQueriesDigestResult) ... ok
test_no_today_file_and_empty_yesterday_file (slapos.test.promise.test_check_slow_queries_digest_result.TestCheckSlowQueriesDigestResult) ... ok
test_no_today_file_but_yesterday_file (slapos.test.promise.test_check_slow_queries_digest_result.TestCheckSlowQueriesDigestResult) ... ok
test_threshold_is_greater (slapos.test.promise.test_check_slow_queries_digest_result.TestCheckSlowQueriesDigestResult) ... ok
test_check_memory (slapos.test.promise.test_check_user_memory.TestUserMemory) ... ok
test_check_memory_with_unavailable_dates (slapos.test.promise.test_check_user_memory.TestUserMemory) ... ok
test_getServerStatus (slapos.test.promise.test_apache_mpm_watchdog.TestApacheMPMWatchdog) ... ok
test_loadJSONFile (slapos.test.promise.test_apache_mpm_watchdog.TestApacheMPMWatchdog) ... ok
test_writeJSONFile (slapos.test.promise.test_apache_mpm_watchdog.TestApacheMPMWatchdog) ... ok
test_port6_is_not_open (slapos.test.promise.test_is_local_tcp_port_opened.TestLocalTcpPortOpened) ... ok
test_port6_is_open (slapos.test.promise.test_is_local_tcp_port_opened.TestLocalTcpPortOpened) ... ok
test_port_is_not_open (slapos.test.promise.test_is_local_tcp_port_opened.TestLocalTcpPortOpened) ... ok
test_port_is_open (slapos.test.promise.test_is_local_tcp_port_opened.TestLocalTcpPortOpened) ... ok
test_no_today_file_and_empty_yesterday_file (slapos.test.promise.test_check_apachedex_result.TestCheckApacheDigestResult) ... ok
test_no_today_file_but_yesterday_file (slapos.test.promise.test_check_apachedex_result.TestCheckApacheDigestResult) ... ok
test_threshold_is_greater (slapos.test.promise.test_check_apachedex_result.TestCheckApacheDigestResult) ... ok
test_threshold_is_lower (slapos.test.promise.test_check_apachedex_result.TestCheckApacheDigestResult) ... ok
test_error (slapos.test.promise.test_check_error_on_apache_log.TestCheckErrorOnApacheLog) ... ok
test_error_timeout (slapos.test.promise.test_check_error_on_apache_log.TestCheckErrorOnApacheLog) ... ok
test_error_unreacheabler (slapos.test.promise.test_check_error_on_apache_log.TestCheckErrorOnApacheLog) ... ok
test_no_error (slapos.test.promise.test_check_error_on_apache_log.TestCheckErrorOnApacheLog) ... ok
test_ipv4_is_faster (slapos.test.promise.test_check_re6st_optimal_status.TestCheckRe6stOptimalStatus) ... ok
test_ipv4_unreacheable_and_ipv6_ok (slapos.test.promise.test_check_re6st_optimal_status.TestCheckRe6stOptimalStatus) ... ok
test_ipv6_fail (slapos.test.promise.test_check_re6st_optimal_status.TestCheckRe6stOptimalStatus) ... ok
test_ipv6_is_faster (slapos.test.promise.test_check_re6st_optimal_status.TestCheckRe6stOptimalStatus) ... ok
test_error (slapos.test.promise.test_is_icmp_packet_lost.TestIsICMPPacketLost) ... ok
test_error6 (slapos.test.promise.test_is_icmp_packet_lost.TestIsICMPPacketLost) ... ok
test_error_4_6 (slapos.test.promise.test_is_icmp_packet_lost.TestIsICMPPacketLost) ... FAIL
test_localhost (slapos.test.promise.test_is_icmp_packet_lost.TestIsICMPPacketLost) ... ok
test_localhost6 (slapos.test.promise.test_is_icmp_packet_lost.TestIsICMPPacketLost) ... ok
test_check_memory (slapos.test.promise.test_check_computer_memory.TestComputerMemory) ... ok
test_check_memory_with_unavailable_dates (slapos.test.promise.test_check_computer_memory.TestComputerMemory) ... ok
test_UserCanLoginAndUpdateCredentials (slapos.test.test_runner.TestRunnerBackEnd) ... ok
test_autoDeployWontEraseExistingInstances (slapos.test.test_runner.TestRunnerBackEnd) ... skipped 'No scenario defined'
test_changingSRUpdatesProjectFileWithExistingPath (slapos.test.test_runner.TestRunnerBackEnd) ... ok
test_getCurrentSoftwareReleaseProfile (slapos.test.test_runner.TestRunnerBackEnd) ... ok
test_isSoftwareReleaseReady (slapos.test.test_runner.TestRunnerBackEnd) ... ok
test_parametersAreCorrectlyUpdatedAndGivenToTheInstance (slapos.test.test_runner.TestRunnerBackEnd) ... skipped 'No scenario defined'
test_removingInstanceStopsProcessesAndCleansInstanceDirectory (slapos.test.test_runner.TestRunnerBackEnd) ... ok
test_removingUsedSoftwareReleaseCleansInstancesToo (slapos.test.test_runner.TestRunnerBackEnd) ... ok
test_requestingInstanceCorrectlyPassesTypeAndParameters (slapos.test.test_runner.TestRunnerBackEnd) ... skipped 'No scenario defined'
test_runInstanceWithLockMakesCorrectCallstoSupervisord (slapos.test.test_runner.TestRunnerBackEnd) ... ok
test_runSoftwareDonotRestartForeverEvenIfBuildoutFileIsWrong (slapos.test.test_runner.TestRunnerBackEnd) ... ok
test_runSoftwareRunOnlyOnceIfSoftwareSuccessfullyCompiledOnFirstTime (slapos.test.test_runner.TestRunnerBackEnd) ... ok
test_runSoftwareWithLockMakesCorrectCallstoSupervisord (slapos.test.test_runner.TestRunnerBackEnd) ... ok

======================================================================
FAIL: test_dnsbench_ok (slapos.test.test_networkbench.TestDNSBench)
Test dns resolution, this test may fail if
----------------------------------------------------------------------
Traceback (most recent call last):
File "/srv/slapgrid/slappart6/srv/testnode/ij/inst/test0-0/parts/slapos.toolbox/slapos/test/test_networkbench.py", line 54, in test_dnsbench_ok
"%s != OK, full info: %s" % (info[4], info) )
AssertionError: UNEXPECTED != OK, full info: ('DNS', 'www.erp5.com', 200, 0.01692795753479004, 'UNEXPECTED', "['85.118.38.162', '176.31.129.213'] (expected) != [u'23.253.204.95', u'192.99.0.211'] (found)")

======================================================================
FAIL: test_error_4_6 (slapos.test.promise.test_is_icmp_packet_lost.TestIsICMPPacketLost)
----------------------------------------------------------------------
Traceback (most recent call last):
File "/srv/slapgrid/slappart6/srv/testnode/ij/inst/test0-0/parts/slapos.toolbox/slapos/test/promise/test_is_icmp_packet_lost.py", line 54, in test_error_4_6
self.assertEquals(result[4], -1)
AssertionError: '0' != -1

----------------------------------------------------------------------
Ran 126 tests in 122.872s

FAILED (failures=2, skipped=3)
Test failed: <unittest.runner.TextTestResult run=126 errors=0 failures=2>
error: Test failed: <unittest.runner.TextTestResult run=126 errors=0 failures=2>